program: Gaussian 09
title: 000219497
version: EM64L-G09RevD.01
frameworkgroup: C1[X(C12H16O2)]
method: RPBEPBE
basis: SDD
operation: Freq
keyword: #pfreq=noraman
keyword: PBEPBE/SDD
title: #p freq=noraman PBEPBE/SDD
converged: YES YES NO NO
title: Mulliken charges:
elementType: O O C C C C C C C C C C C C H H H H H H H H H H H H H H H H
charge: -0.300526 -0.258018 0.243493 -0.270818 -0.711816 -0.700980 -0.701102 0.205197 0.212336 -0.342064 -0.337764 -0.221729 -0.218924 -0.222935 0.229481 0.229355 0.212668 0.218778 0.212746 0.206019 0.208319 0.232187 0.205960 0.208408 0.232126 0.270360 0.263176 0.233277 0.230654 0.232137
chargesum: 0.00000
title: Mulliken charges with hydrogens summed into heavy atoms:
elementType: O O C C C C C C C C C C C C
charge: -0.300526 -0.258018 0.243493 0.188019 -0.067625 -0.054455 -0.054607 0.205197 0.212336 -0.071705 -0.074588 0.011549 0.011730 0.009202
polarizability: 1.86799078e+02 -7.20757825e+00 1.37826767e+02 1.81128256e-01 7.72730647e-02 8.23546197e+01
1716.lowfreq: -3.8224 0.0006 0.0006 0.0008 6.7203 11.5288 25.5297 41.5007 66.5071
frequency: 24.5216 41.2903 66.4578 69.0379 132.6641 182.1909 182.8519 213.4387 226.3387 241.1444 250.6139 287.5151 317.1998 354.1720 396.4672 404.4938 407.5787 443.0439 446.1174 529.8677 614.4119 654.1284 680.3619 702.1223 736.7116 795.2081 816.7548 865.3947 902.9221 903.1309 926.5656 933.1521 945.5605 949.6747 953.9331 990.7008 996.2341 1008.6626 1021.3995 1026.7309 1044.0325 1061.5820 1088.2911 1173.8615 1180.7901 1181.9640 1220.2413 1245.6890 1279.1746 1285.1130 1315.0285 1348.5281 1370.8114 1373.7940 1389.6042 1401.6868 1437.7872 1457.4524 1458.1865 1465.3863 1468.0348 1478.5325 1482.3395 1482.9015 1495.8680 1583.8547 1611.4111 1618.5689 2968.3171 2972.7333 2977.3037 2991.4151 3056.4239 3061.6592 3067.6753 3069.3426 3074.7645 3083.7490 3088.6551 3129.3552 3142.2998 3154.7094 3166.8662 3177.8179
redmass: 3.2475 3.4987 5.4410 4.1133 3.2029 3.1448 1.2404 3.1160 3.8821 1.0387 1.1108 4.0705 2.0460 3.1019 1.9824 2.8257 3.1646 3.6502 3.0791 4.9523 6.4412 6.8758 5.0332 1.5912 3.9521 2.1886 6.0033 1.2444 1.9340 3.1070 1.7900 1.3961 1.2108 2.3261 1.4221 6.2578 1.3823 1.3287 2.7039 1.4587 1.4227 2.8357 1.8646 1.0563 1.3298 1.1276 2.5196 3.7749 2.9466 1.9749 1.3224 1.5072 1.2109 1.2032 9.9309 1.2190 2.2458 1.0494 1.0745 1.0498 1.0474 2.2824 1.0565 1.0598 1.0732 6.9619 6.3109 9.6158 1.0353 1.0353 1.0368 1.0558 1.1066 1.1002 1.0994 1.1007 1.0986 1.0997 1.0989 1.0855 1.0891 1.0939 1.0976 1.0979
irintensity: 0.2497 0.7795 1.1999 0.6740 0.7579 0.3219 0.1004 2.0384 4.2643 0.1601 1.6879 5.9791 0.3132 3.0756 0.4925 0.0001 1.5863 0.3919 2.2116 0.3099 0.3964 6.8059 14.3691 90.3280 0.3392 22.8699 3.0318 0.0948 1.1040 5.4604 26.6364 1.9869 0.1906 40.1033 3.8907 0.4529 0.1004 0.4229 76.4760 0.6884 0.6699 230.6731 43.3725 0.0679 0.2719 47.4718 75.9454 290.6536 6.6238 6.4745 2.7903 18.8923 25.1948 24.3416 2.5011 12.6612 15.4884 0.0298 2.5868 0.9627 0.2420 7.1483 13.3433 13.6514 27.5417 47.8061 14.6635 147.4159 31.1539 43.9503 16.2000 21.9632 1.8920 3.3662 11.6613 74.4727 75.9450 3.7532 77.5552 0.2897 11.1160 16.3073 22.4550 8.8241
temp: 298.150 k
press: 1.00000 atm
elementType: 8 8 6 6 6 6 6 6 6 6 6 6 6 6 1 1 1 1 1 1 1 1 1 1 1 1 1 1 1 1
symmnumber: 1
zpe: 656895.6 jmol-1
zpe.correction: 0.250198 hartree
zpe.thermalcorrener: 0.264770 hartree
zpe.thermalcorrenthalpy: 0.265715 hartree
zpe.thermalcorrgfe: 0.207775 hartree
zpe.sumelectzpe: -616.278571 hartree
zpe.sumelectthermal: -616.263998 hartree
zpe.sumelectthermalent: -616.263054 hartree
zpe.sumelectthermalfe: -616.320994 hartree
dipole: -0.1965 -2.1773 0.0051
dipole: 2.1861
quadrupole: -67.7011 -86.6454 -87.0717
quadrupole: -2.3986 0.0324 0.0216
quadrupole: 12.7716 -6.1727 -6.5990 -2.3986 0.0324 0.0216
hfenergy: -616.528769 hartree
pointgroup: C01 [X(C12H16O2)]
dipole: 0.0712008 0.8564173 -0.0351555 debye
polarizability: 186.8939259|-6.8186741|137.6069745|1.0478116|-2.5778471|82.4795642 unknown
InChI: InChI=1S/C12H16O2/c1-12(2,3)9-14-11(13)10-7-5-4-6-8-10/h4-8H,9H2,1-3H3
charge 0 multiplicity 1
30 atoms
O  0.836676 -0.150925 -0.042525
O  -0.117229 -2.274345 0.046222
C  3.252041 0.328036 -0.033538
C  2.184935 -0.78507 -0.002065
C  4.636911 -0.372641 0.011574
C  3.093402 1.254696 1.199576
C  3.124263 1.15306 -1.340387
C  -0.251676 -1.025463 -0.011053
C  -1.557661 -0.303752 -0.05229
C  -2.746123 -1.07896 -0.023373
C  -1.637853 1.111733 -0.118184
C  -4.004393 -0.444291 -0.059823
C  -2.899414 1.742633 -0.154847
C  -4.083389 0.967582 -0.1258
H  2.254527 -1.392026 0.920484
H  2.274365 -1.462887 -0.872068
H  4.756233 -0.974102 0.932733
H  5.444421 0.381938 -0.005608
H  4.781036 -1.04177 -0.857863
H  3.198021 0.684977 2.142483
H  3.868853 2.042807 1.190315
H  2.102513 1.741379 1.202718
H  3.253607 0.509987 -2.231695
H  3.898071 1.942144 -1.375238
H  2.133191 1.6348 -1.407577
H  -2.657946 -2.169294 0.027308
H  -0.715502 1.698721 -0.139609
H  -4.920334 -1.044503 -0.037186
H  -2.961821 2.835128 -0.205728
H  -5.061521 1.460904 -0.154356
