program: Gaussian 09
title: 000219491
version: EM64L-G09RevD.01
frameworkgroup: C1[X(C7H5Br2NO2)]
method: RPBEPBE
basis: SDD
operation: Freq
keyword: #p
keyword: freq=noraman
keyword: PBEPBE/SDD
title: #p freq=noraman PBEPBE/SDD
converged: YES YES NO YES
title: Mulliken charges:
elementType: Br Br O O N C C C C C C C H H H H H
charge: 0.024492 0.020657 -0.436675 -0.308253 -0.668606 0.119718 0.468839 -0.241969 -0.395019 -0.237805 -0.157460 0.153948 0.294130 0.272760 0.379387 0.320741 0.391114
chargesum: 0.00000
title: Mulliken charges with hydrogens summed into heavy atoms:
elementType: Br Br O O N C C C C C C C
charge: 0.024492 0.020657 -0.045561 -0.308253 0.031523 0.119718 0.468839 0.052161 -0.395019 -0.237805 0.115301 0.153948
polarizability: 1.78972965e+02 -1.37764616e+00 1.59248999e+02 3.17145003e-03 -1.38225860e-03 4.27060924e+01
1716.lowfreq: -3.0252 -0.0006 -0.0005 -0.0003 5.4365 6.0134 65.2940 99.6965 116.8925
frequency: 65.2874 99.6965 116.8923 125.7612 146.1480 184.7104 240.5435 279.9908 321.5245 330.7815 379.2481 417.3715 450.4974 531.2936 547.8332 548.0142 582.8378 618.3420 662.0880 689.7603 746.5316 779.4357 781.2117 842.1759 888.1135 924.5883 1015.6616 1060.1312 1101.8000 1144.7533 1248.1396 1309.0034 1328.7529 1381.3128 1399.8863 1468.6183 1522.7980 1564.4040 1619.9528 1631.1333 3178.3542 3193.6179 3400.1017 3536.1633 3621.6581
redmass: 8.0070 12.0312 22.6345 6.8878 13.6035 4.4333 19.2416 9.6569 6.9783 5.6073 6.4443 6.5721 3.6839 1.1511 4.0959 3.1579 1.2598 5.0624 9.1211 7.5298 1.5959 6.1388 2.3089 6.6287 1.4162 1.3985 4.1031 1.9270 1.9090 2.0124 1.3034 2.5126 2.6863 6.0655 6.4868 3.6993 3.7631 4.8102 2.3257 3.4159 1.0933 1.0927 1.0549 1.0642 1.0960
irintensity: 0.0302 0.0862 0.0221 1.3111 0.0001 0.5628 1.1814 0.4479 6.7669 3.5486 13.5508 2.2484 5.6800 87.9091 12.3657 17.6279 200.0829 44.9623 98.2205 0.2311 34.8747 5.0988 140.2470 17.4203 14.5641 6.7615 228.1055 97.3514 19.7589 213.1374 8.6856 7.3194 136.4510 0.1888 30.7459 120.5936 201.5450 207.9844 159.0745 141.3254 0.1119 3.2469 132.2092 70.8900 85.7068
temp: 298.150 k
press: 1.00000 atm
elementType: 35 35 8 8 7 6 6 6 6 6 6 6 1 1 1 1 1
symmnumber: 1
zpe: 287264.8 jmol-1
zpe.correction: 0.109413 hartree
zpe.thermalcorrener: 0.120783 hartree
zpe.thermalcorrenthalpy: 0.121727 hartree
zpe.thermalcorrgfe: 0.069961 hartree
zpe.sumelectzpe: -501.028011 hartree
zpe.sumelectthermal: -501.016641 hartree
zpe.sumelectthermalent: -501.015697 hartree
zpe.sumelectthermalfe: -501.067464 hartree
dipole: -1.1765 1.0730 0.0011
dipole: 1.5923
quadrupole: -84.7835 -80.0906 -91.0776
quadrupole: 4.2632 -0.0035 0.0061
quadrupole: 0.5337 5.2266 -5.7603 4.2632 -0.0035 0.0061
hfenergy: -501.1374244 hartree
pointgroup: C01 [X(C7H5Br2N1O2)]
dipole: -0.5055109 0.3698149 0.0119011 debye
dipolederiv: -0.1985896 -0.2342541 0.0063888 -0.223433 -0.5561216 0.0091827 0.0063175 0.009356 -0.017041 -0.2795441 0.3043621 0.0055934 0.3204826 -0.4852951 -0.006583 0.0054208 -0.005972 -0.0239192 -0.6255206 -0.4613738 0.0080522 -0.6979325 -1.1228143 0.0231135 0.0089713 0.016161 -0.4207449 -1.1680569 0.1798819 0.0223777 0.2797009 -0.6853155 -0.0064484 0.0216219 -0.0034153 -0.3519528 -0.5969752 0.599971 -0.0034517 0.4194337 -1.0789929 -0.0095672 -0.0024628 -0.0149894 -0.6134959 -1.0440604 -0.4308865 0.0303145 0.2745293 -0.1250532 -0.0074487 0.0267443 0.0123783 -0.0509236 0.3806249 -0.8533466 -0.001573 -0.5804178 0.6775552 0.0139248 -0.0028736 0.021573 0.1736081 0.3678209 0.3468802 -0.0130435 -0.1748483 -0.2988077 0.0064487 -0.0104497 -0.0082202 -0.0272224 0.1518025 0.960996 -0.0144208 0.4909155 0.7568186 -0.0188702 -0.0120118 -0.0319142 -0.1819737 0.0420537 -0.8370843 -0.0020165 -0.8179083 0.6018449 0.0188187 -0.0019166 0.0191616 -0.1885755 -0.1143053 -0.0016518 0.0037804 0.2631258 -0.0366422 -0.0070411 0.0024277 0.000507 0.0201412 2.1414235 0.4216679 -0.0560431 0.3627997 1.2985064 -0.0151249 -0.0553257 -0.0167618 0.2403889 0.1421607 -0.0382958 0.0007308 -0.0197896 0.053015 0.0011039 0.0006164 0.0016145 0.1603883 0.007953 -0.0180668 0.0041745 -0.0141546 0.1230328 0.000552 0.004117 0.0006263 0.1528738 0.3472976 0.0055927 0.0004904 -0.0061228 0.2860836 0.000573 0.0004396 0.0003988 0.3661129 0.2440041 -0.0308304 0.0034142 -0.0480398 0.2614657 0.0018932 0.0035051 0.0015938 0.3598493 0.2019114 0.0864383 0.0052316 0.1716591 0.3307201 -0.0045271 0.0048584 -0.0020973 0.4024865 unknown
polarizability: 160.4700953|-5.1249338|177.6556276|-3.3015526|-0.5606125|42.8023342 unknown
InChI: InChI=1S/C7H5Br2NO2/c8-3-1-4(7(11)12)6(10)5(9)2-3/h1-2,11H,10H2
charge 0 multiplicity 1
17 atoms
Br 2.135559 2.91919 -0.044377
Br 2.629803 -2.856498 -0.027788
O  -2.625302 -1.724207 0.113923
O  -3.043156 0.551561 0.114878
N  -0.93667 2.20994 0.046602
C  -0.733459 -0.244568 0.05344
C  -0.156674 1.082862 0.030305
C  0.095539 -1.400617 0.035809
C  1.276501 1.151949 -0.010767
C  1.48518 -1.265775 -0.004204
C  2.091892 0.0159 -0.027959
C  -2.195527 -0.393183 0.095639
H  -0.381016 -2.382776 0.054236
H  3.179473 0.117576 -0.059127
H  -1.956382 2.087755 0.075656
H  -0.501848 3.130633 0.029445
H  -3.619212 -1.735641 0.141988
