program: Gaussian 09
title: 000219486
version: EM64L-G09RevD.01
frameworkgroup: C1[X(C13H9ClN2O2)]
method: RPBEPBE
basis: SDD
operation: Freq
keyword: #p
keyword: freq=noraman
keyword: PBEPBE/SDD
title: #p freq=noraman PBEPBE/SDD
converged: NO YES NO NO
title: Mulliken charges:
elementType: Cl O O N N C C C C C C C C C C C C C H H H H H H H H H
charge: -0.033403 -0.219741 -0.219739 -0.092816 0.021694 0.316233 0.466279 0.374239 -0.347588 -0.347508 -0.339877 -0.339936 -0.389672 -0.353145 -0.354388 -0.210650 -0.200202 -0.103002 0.256117 0.256098 0.287101 0.287089 0.240047 0.239594 0.281106 0.263112 0.262959
chargesum: 0.00000
title: Mulliken charges with hydrogens summed into heavy atoms:
elementType: Cl O O N N C C C C C C C C C C C C C
charge: -0.033403 -0.219741 -0.219739 -0.092816 0.021694 0.316233 0.466279 0.374239 -0.091471 -0.091410 -0.052776 -0.052847 -0.149625 -0.113551 -0.073282 0.052462 0.062757 -0.103002
polarizability: 3.98089157e+02 1.00853388e-02 1.18340830e+02 -1.15939351e+00 -2.97661388e-02 1.12251498e+02
1716.lowfreq: -52.6877 -3.5496 -3.2578 -0.0022 -0.0012 -0.0006 9.8223 30.5024 30.7032
frequency: -52.6866 30.4409 30.6899 65.9641 77.0230 99.1992 155.6281 155.8903 219.8087 230.6717 293.9290 320.6609 357.2509 368.9005 406.5477 412.6824 431.6893 461.7651 503.3055 514.7933 530.0981 613.9793 623.0915 625.6825 663.9872 680.2916 720.0661 732.2268 765.2328 822.1031 827.8145 828.0854 830.9261 845.0536 859.0674 953.9766 978.0592 984.1975 985.5301 994.2174 996.8915 999.8534 1070.0642 1093.9715 1105.3840 1108.1610 1162.4870 1178.6447 1186.5391 1223.0013 1249.8597 1288.2811 1293.0833 1347.4061 1354.6945 1382.8748 1398.1082 1408.3633 1427.6517 1468.4946 1483.3495 1577.9387 1578.6714 1595.4723 1605.8896 1652.1953 2971.3037 3133.4277 3155.8138 3158.1940 3159.3622 3174.5169 3177.4463 3183.9155 3186.6942
redmass: 4.2890 10.4522 10.0671 7.7587 6.2573 8.3682 9.4764 4.2290 8.3761 8.8898 5.9317 3.9228 11.8375 5.5382 3.1268 2.9142 5.6703 7.5844 4.6772 3.3079 3.8672 8.0333 7.1385 7.1228 5.0120 6.3139 3.6483 5.1229 9.2464 6.4478 1.3347 3.0269 1.2524 1.3495 2.1253 1.3521 1.3182 1.3716 1.3885 1.5168 2.9360 3.8626 2.9140 3.2825 1.2756 1.3785 1.8613 1.1567 1.9515 5.5229 1.9973 1.2778 1.3194 6.4051 2.7776 9.0263 4.3363 1.9850 4.5994 2.2894 2.8243 8.1628 7.5478 6.2035 6.3236 9.0154 1.0886 1.0901 1.0889 1.0897 1.0896 1.0958 1.0973 1.0954 1.0967
irintensity: 0.8681 1.1246 1.8496 0.2404 0.2792 0.6236 3.8008 3.4783 7.1980 5.1757 0.7116 3.6775 3.0533 36.3001 0.5669 0.1201 13.0079 6.6475 7.5925 21.3298 13.4339 22.9746 0.0774 0.4847 18.3328 17.0913 1.9555 3.2496 1.1342 9.9453 28.2505 148.6552 3.7632 30.0464 123.1929 2.8331 3.8956 1.5420 3.0796 12.9687 9.8338 43.8257 89.6630 28.7873 21.3663 17.9179 425.5015 7.6419 15.1095 527.9844 1.8614 0.4299 9.0905 63.7387 30.5000 54.0938 11.7956 6.9031 13.3241 1.2332 73.3727 7.7225 40.7170 509.3372 49.0217 466.2572 35.7742 6.9245 0.2516 5.1114 0.8720 3.3334 2.2495 0.0514 4.8964
temp: 298.150 k
press: 1.00000 atm
elementType: 17 8 8 7 7 6 6 6 6 6 6 6 6 6 6 6 6 6 1 1 1 1 1 1 1 1 1
symmnumber: 1
zpe: 499671.4 jmol-1
zpe.correction: 0.190315 hartree
zpe.thermalcorrener: 0.204778 hartree
zpe.thermalcorrenthalpy: 0.205723 hartree
zpe.thermalcorrgfe: 0.146573 hartree
zpe.sumelectzpe: -1219.453568 hartree
zpe.sumelectthermal: -1219.439105 hartree
zpe.sumelectthermalent: -1219.438160 hartree
zpe.sumelectthermalfe: -1219.497310 hartree
dipole: 6.4645 -0.0179 1.3584
dipole: 6.6058
quadrupole: -167.6320 -108.5232 -102.7940
quadrupole: -0.0476 3.6172 -0.0885
quadrupole: -41.3156 17.7932 23.5224 -0.0476 3.6172 -0.0885
hfenergy: -1219.643883 hartree
pointgroup: C01 [X(C13H9Cl1N2O2)]
dipole: 2.5424515 -0.0052242 0.5387229 debye
polarizability: 398.0922331|0.0065977|118.3405613|-0.6818954|-0.0502143|112.2486904 unknown
InChI: InChI=1S/C13H9ClN2O2/c14-11-3-1-10(2-4-11)9-15-12-5-7-13(8-6-12)16(17)18/h1-9H
charge 0 multiplicity 1
27 atoms
Cl 7.168611 0.003428 -0.307098
O  -6.017098 1.141524 0.050133
O  -6.016942 -1.142148 0.031905
N  0.268531 0.004126 -0.429126
N  -5.408133 0.000052 0.000435
C  -1.130655 0.002612 -0.268961
C  2.584562 -0.003216 0.324924
C  -3.937115 0.000956 -0.098298
C  -1.847731 1.234373 -0.22401
C  -1.847451 -1.229868 -0.243311
C  -3.249001 1.235835 -0.134378
C  -3.248735 -1.233044 -0.153764
C  1.129071 -0.00529 0.550959
C  3.463254 -0.014307 1.441026
C  3.128443 0.009892 -0.989969
C  4.861756 -0.012401 1.258533
C  4.521002 0.011951 -1.18745
C  5.36767 0.00077 -0.056379
H  -1.292904 2.176531 -0.266711
H  -1.292444 -2.171134 -0.300798
H  -3.819217 2.167325 -0.089659
H  -3.818762 -2.165243 -0.123699
H  0.797977 -0.015435 1.61005
H  3.05405 -0.024476 2.458404
H  2.441032 0.018387 -1.841761
H  5.542323 -0.020909 2.11416
H  4.947107 0.022007 -2.194555
