program: Gaussian 09
title: 000219483
version: EM64L-G09RevD.01
frameworkgroup: C1[X(C14H10Cl2N2)]
method: RPBEPBE
basis: SDD
operation: Freq
keyword: #p
keyword: freq=noraman
keyword: PBEPBE/SDD
title: #p freq=noraman PBEPBE/SDD
converged: NO NO NO NO
title: Mulliken charges:
elementType: Cl Cl N N C C C C C C C C C C C C C C H H H H H H H H H H
charge: -0.045267 -0.045267 -0.085957 -0.085958 0.435844 0.435844 -0.356766 -0.356767 -0.349326 -0.349326 -0.208882 -0.208882 -0.204168 -0.204169 -0.099868 -0.099868 -0.361291 -0.361290 0.237225 0.237226 0.277384 0.277384 0.259014 0.259014 0.258312 0.258312 0.243747 0.243747
chargesum: 0.00000
title: Mulliken charges with hydrogens summed into heavy atoms:
elementType: Cl Cl N N C C C C C C C C C C C C C C
charge: -0.045267 -0.045267 -0.085957 -0.085958 0.435844 0.435844 -0.119541 -0.119541 -0.071942 -0.071942 0.050131 0.050132 0.054144 0.054143 -0.099868 -0.099868 -0.117544 -0.117544
polarizability: 5.36737306e+02 1.28381076e+01 1.66309253e+02 -2.95464994e-03 1.61444437e-03 6.69024760e+01
1716.lowfreq: -5.0534 0.0022 0.0025 0.0033 3.4851 15.3444 23.7814 29.4009 34.9163
frequency: 23.7814 29.4009 34.9163 60.1808 92.8793 108.0559 159.8587 182.2077 194.6272 225.0346 245.4634 284.5914 312.5514 351.6657 354.6104 389.3245 412.7130 413.6288 428.4068 504.7362 514.4766 527.5014 536.9166 622.0443 624.5212 675.6261 698.4278 716.7579 721.2326 826.6174 828.9953 842.9093 844.2658 846.2021 863.2353 950.9841 954.8817 969.5461 980.6431 984.9606 989.2165 992.9981 997.7993 998.4365 1068.8154 1069.6445 1107.7111 1109.0307 1179.0853 1179.3576 1228.8239 1235.5778 1291.4706 1294.6785 1309.5976 1356.6700 1372.0011 1373.4328 1399.3890 1401.1705 1473.0020 1477.0331 1504.3213 1565.4764 1577.0700 1594.7216 1598.5815 1604.3188 3029.7763 3033.5287 3133.3081 3133.3225 3155.2548 3155.2733 3170.1156 3170.1326 3175.1362 3175.2059
redmass: 13.9287 9.8197 3.7216 8.0333 8.7766 10.0941 3.6028 10.4976 4.5128 9.1776 5.4670 5.9273 8.8810 3.7752 6.1202 5.5695 2.9258 3.0234 9.3186 2.6914 5.7617 3.0452 8.0178 7.1485 7.1857 6.5288 6.8807 3.5979 3.5581 1.3215 1.3193 4.5369 1.3548 1.4072 4.1975 1.3431 1.3465 8.1402 1.4451 1.3689 1.4402 1.5204 4.0192 3.9350 2.8328 2.8129 1.3618 1.3582 1.1149 1.1168 2.2024 1.8348 1.3723 1.2923 1.5325 2.9644 4.5080 2.8023 4.4358 3.9683 2.4480 2.7592 5.6548 7.8495 7.1896 6.4593 6.2449 6.3781 1.0877 1.0889 1.0898 1.0898 1.0885 1.0885 1.0957 1.0957 1.0977 1.0977
irintensity: 0.0045 0.1178 0.7782 0.0000 0.0000 5.5611 0.0000 0.0000 10.6335 3.9749 0.0000 0.0000 11.6793 2.8720 19.9113 0.0000 0.1284 0.0000 0.0000 72.6917 0.0000 0.0000 32.9061 0.9295 0.0000 0.0000 10.5191 5.0099 0.0000 53.5180 0.0000 37.4759 64.1865 0.0000 0.0000 12.1783 0.0000 0.0000 24.3432 0.0000 23.3926 0.0000 97.3580 0.0000 163.8962 0.0000 19.6719 0.0000 23.5264 0.0000 31.3277 0.0000 7.0806 0.0000 9.5946 0.0000 25.3368 0.0000 0.0000 32.0754 195.7547 0.0000 0.0000 30.8959 0.0000 23.9175 0.0000 274.9959 43.4597 0.0000 0.1420 14.9731 1.0925 0.0125 12.3833 0.0039 9.0980 0.0090
temp: 298.150 k
press: 1.00000 atm
elementType: 17 17 7 7 6 6 6 6 6 6 6 6 6 6 6 6 6 6 1 1 1 1 1 1 1 1 1 1
symmnumber: 1
zpe: 526475.7 jmol-1
zpe.correction: 0.200524 hartree
zpe.thermalcorrener: 0.216449 hartree
zpe.thermalcorrenthalpy: 0.217393 hartree
zpe.thermalcorrgfe: 0.154150 hartree
zpe.sumelectzpe: -1567.828959 hartree
zpe.sumelectthermal: -1567.813034 hartree
zpe.sumelectthermalent: -1567.812090 hartree
zpe.sumelectthermalfe: -1567.875333 hartree
dipole: 0.0000 0.0000 0.0000
dipole: 0.0000
quadrupole: -136.2585 -101.3198 -123.7382
quadrupole: 8.2217 0.0003 0.0003
quadrupole: -15.8196 19.1190 -3.2994 8.2217 0.0003 0.0003
hfenergy: -1568.0294833 hartree
pointgroup: C01 [X(C14H10Cl2N2)]
dipole: -0.000001 -0.0000002 0.0000041 debye
polarizability: 537.1108907|5.1275072|165.9356689|-0.0029204|0.0016755|66.902476 unknown
InChI: InChI=1S/C14H10Cl2N2/c15-13-5-1-11(2-6-13)9-17-18-10-12-3-7-14(16)8-4-12/h1-10H
charge 0 multiplicity 1
28 atoms
Cl 7.562484 -0.506838 -0.000221
Cl -7.561027 0.506481 -0.000081
N  0.66398 -0.268521 -0.000064
N  -0.662522 0.268164 -0.000089
C  3.009171 0.377063 -0.000077
C  -3.007714 -0.37742 -0.000092
C  3.953604 1.441636 -0.000021
C  -3.952147 -1.441993 -0.000035
C  3.48633 -0.966736 -0.000178
C  -3.484873 0.966379 -0.000142
C  5.33985 1.182741 -0.00006
C  -5.338393 -1.183097 -0.000029
C  4.866101 -1.23858 -0.000222
C  -4.864644 1.238224 -0.000138
C  5.775599 -0.157331 -0.000162
C  -5.774142 0.156974 -0.000082
C  1.577548 0.685944 -0.000033
C  -1.576091 -0.686301 -0.000108
H  3.601225 2.480033 0.00006
H  -3.599769 -2.48039 0.000006
H  2.7565 -1.7820 -0.000218
H  -2.755043 1.781643 -0.000184
H  6.065433 2.001213 -0.000016
H  -6.063976 -2.001569 0.000013
H  5.236093 -2.268096 -0.000295
H  -5.234636 2.267739 -0.000173
H  1.270218 1.747214 -0.000039
H  -1.268761 -1.747571 -0.000122
