program: Gaussian 09
title: 000219479
version: EM64L-G09RevD.01
frameworkgroup: C1[X(C11H16O)]
method: RPBEPBE
basis: SDD
operation: Freq
keyword: #pfreq=noraman
keyword: PBEPBE/SDD
title: #p freq=noraman PBEPBE/SDD
converged: YES YES NO NO
title: Mulliken charges:
elementType: O C C C C C C C C C C C H H H H H H H H H H H H H H H H
charge: -0.446899 0.226343 -0.533312 0.151005 -0.362241 0.381733 0.126032 -0.441194 -0.833274 -0.420651 -0.692923 -0.823676 0.195468 0.243126 0.224647 0.201782 0.228747 0.241201 0.225036 0.230436 0.213147 0.205991 0.215498 0.217983 0.223383 0.228074 0.222143 0.352393
chargesum: 0.00000
title: Mulliken charges with hydrogens summed into heavy atoms:
elementType: O C C C C C C C C C C C
charge: -0.094506 0.226343 -0.094718 0.151005 0.064189 0.381733 0.126032 -0.212447 -0.136600 -0.207504 -0.053451 -0.150077
polarizability: 1.51730641e+02 3.23850635e+00 1.38577242e+02 -7.23444271e+00 3.68390511e+00 7.62254194e+01
1716.lowfreq: -3.4653 0.0007 0.0008 0.0010 3.6790 11.9195 58.0389 74.5622 83.8562
frequency: 57.5046 74.5506 83.7050 108.1288 130.0147 164.2508 181.6311 224.9906 273.9069 294.5185 307.3388 329.5244 345.8953 364.5034 378.3487 457.6384 492.8985 519.6379 545.5948 592.2462 667.4904 718.6738 743.8518 753.4935 790.3768 841.8419 876.3045 899.1360 913.4370 951.8559 998.5740 1023.0281 1047.9601 1049.9228 1068.4735 1095.3012 1100.2767 1155.5810 1177.7271 1221.3130 1232.9872 1255.3105 1269.2618 1286.3623 1299.2268 1344.9198 1377.4438 1386.8354 1391.7536 1403.8029 1432.3416 1461.2601 1463.5028 1472.9320 1473.9433 1475.7706 1481.0187 1484.4400 1487.7140 1500.6237 1597.7665 1616.2593 2963.3448 2970.8938 2973.0583 2982.6415 2997.9585 3028.8408 3033.7311 3041.3545 3058.8374 3070.1833 3074.2404 3078.1879 3106.8637 3110.7553 3137.2318 3583.6644
redmass: 3.0096 3.1962 1.3106 1.3328 3.2028 1.5024 1.6954 1.1723 3.1884 2.9284 2.5025 1.1585 3.4448 3.4308 2.6186 5.9867 3.3819 3.0549 3.9438 3.6044 4.1021 4.0238 1.4423 2.2714 1.5229 1.8841 1.7155 1.8303 1.3202 2.2557 1.4439 1.4264 2.8654 1.6212 1.7369 2.1300 1.6723 1.3529 1.7425 2.0735 1.7677 1.6312 3.5913 1.2585 1.2513 1.4645 4.6732 1.2137 1.2467 1.2500 2.3269 1.2365 1.3285 1.0585 1.1447 1.0509 1.0665 1.0996 1.8387 1.0842 7.0441 6.4015 1.0379 1.0354 1.0412 1.0604 1.0638 1.0974 1.0968 1.0959 1.0996 1.0997 1.1015 1.0977 1.0876 1.0944 1.0962 1.0659
irintensity: 0.1804 0.6031 0.0551 0.2662 1.0777 2.7580 0.1803 0.0941 1.6612 16.7029 1.0830 103.8056 14.4400 7.0400 0.8466 2.9463 0.6007 3.6606 2.9381 4.3496 1.4298 3.4041 7.8360 6.9646 44.1666 1.7064 3.5211 1.9722 0.0308 34.3133 34.6209 10.6915 0.1390 0.6036 32.2880 21.6873 71.7845 35.8359 20.4361 16.5298 1.8415 47.6007 13.1990 0.1731 2.6114 2.0286 3.5772 10.5332 2.7903 26.1127 10.5808 7.6988 14.9153 9.8764 14.3662 10.2229 20.0268 8.4980 38.2014 6.5983 14.3058 10.5119 50.6738 45.3974 27.2393 12.8883 46.6955 3.6054 37.1740 8.1387 2.7190 55.9323 67.4929 29.0435 16.8948 21.6647 25.7011 26.4125
temp: 298.150 k
press: 1.00000 atm
elementType: 8 6 6 6 6 6 6 6 6 6 6 6 1 1 1 1 1 1 1 1 1 1 1 1 1 1 1 1
symmnumber: 1
zpe: 630603.7 jmol-1
zpe.correction: 0.240184 hartree
zpe.thermalcorrener: 0.253497 hartree
zpe.thermalcorrenthalpy: 0.254441 hartree
zpe.thermalcorrgfe: 0.200846 hartree
zpe.sumelectzpe: -503.078306 hartree
zpe.sumelectthermal: -503.064994 hartree
zpe.sumelectthermalent: -503.064050 hartree
zpe.sumelectthermalfe: -503.117645 hartree
dipole: -0.9747 0.3169 0.2859
dipole: 1.0641
quadrupole: -72.1142 -61.9232 -76.7175
quadrupole: -1.0440 -0.7322 1.5069
quadrupole: -1.8625 8.3284 -6.4659 -1.0440 -0.7322 1.5069
hfenergy: -503.3184903 hartree
pointgroup: C01 [X(C11H16O1)]
dipole: -0.3891749 0.1089331 0.1092747 debye
polarizability: 151.5717969|3.7396421|138.8476332|-6.7104175|3.5299378|76.1138732 unknown
InChI: InChI=1S/C11H16O/c1-4-5-10-9(3)8(2)6-7-11(10)12/h6-7,12H,4-5H2,1-3H3
charge 0 multiplicity 1
28 atoms
O  0.966291 2.468183 -0.221753
C  0.341125 0.135066 -0.315479
C  1.805518 -0.161151 -0.607075
C  -0.65448 -0.878767 -0.200074
C  2.622549 -0.47486 0.678392
C  -2.014053 -0.532945 0.087083
C  -0.051296 1.488354 -0.118787
C  -2.358533 0.825996 0.263502
C  -0.307934 -2.34949 -0.379371
C  -1.385722 1.842785 0.166324
C  4.106681 -0.767676 0.372922
C  -3.084517 -1.605136 0.205206
H  1.902254 -1.007297 -1.313725
H  2.260577 0.71864 -1.095448
H  2.542547 0.389734 1.364901
H  2.167347 -1.337794 1.204194
H  -3.398455 1.094144 0.483255
H  0.7738 -2.523295 -0.477743
H  -0.665392 -2.946514 0.480895
H  -0.799956 -2.768386 -1.279349
H  -1.666609 2.894635 0.30999
H  4.212257 -1.645783 -0.292741
H  4.582609 0.094171 -0.131608
H  4.67564 -0.974991 1.297994
H  -2.875396 -2.307236 1.036244
H  -4.07491 -1.15494 0.390071
H  -3.159367 -2.217485 -0.71424
H  0.583029 3.370639 -0.092479
