program: Gaussian 09
title: 000219477
version: EM64L-G09RevD.01
frameworkgroup: C1[X(C12H16O2)]
method: RPBEPBE
basis: SDD
operation: Freq
keyword: #pfreq=noraman
keyword: PBEPBE/SDD
title: #p freq=noraman PBEPBE/SDD
converged: YES YES NO NO
title: Mulliken charges:
elementType: O O C C C C C C C C C C C C H H H H H H H H H H H H H H H H
charge: -0.277091 -0.241543 -0.463881 0.158420 -0.372635 0.127827 0.207803 -0.466425 0.459622 -0.346031 -0.699226 -0.430301 -0.807570 -0.536415 0.243428 0.233891 0.221870 0.191571 0.284784 0.237140 0.249651 0.210532 0.196155 0.232520 0.219822 0.234108 0.234632 0.225932 0.224657 0.246755
chargesum: 0.00000
title: Mulliken charges with hydrogens summed into heavy atoms:
elementType: O O C C C C C C C C C C C C
charge: -0.277091 -0.241543 0.013437 0.158420 0.040806 0.127827 0.207803 -0.181642 0.459622 -0.108891 -0.042888 -0.197782 -0.119008 0.160928
polarizability: 1.78237238e+02 -4.07584057e+00 1.59049763e+02 6.94656222e+00 2.91339964e+00 8.17410772e+01
1716.lowfreq: -16.2963 -9.0175 -0.0008 -0.0006 -0.0005 2.9141 14.9263 21.2191 53.6275
frequency: 7.0364 21.1662 53.4918 87.1629 109.7781 123.4255 138.7122 168.4784 195.4614 220.9253 245.6093 262.2616 286.4615 342.4554 348.6071 389.0287 401.6583 418.8491 455.7500 521.6233 581.4690 593.4344 637.9252 695.9732 710.5330 733.4800 793.7683 810.9822 853.6021 869.5519 903.7835 927.6284 966.3419 977.5988 993.1162 1034.1345 1052.7559 1063.1477 1072.3302 1100.1836 1111.2928 1137.6478 1152.8617 1173.6953 1211.1777 1221.5249 1231.9594 1267.5731 1279.6974 1340.8212 1345.7893 1377.0471 1381.9352 1394.1693 1402.2134 1406.4689 1435.8168 1454.9417 1468.9186 1469.9572 1470.3906 1474.2359 1477.9985 1488.7928 1490.7752 1563.7262 1579.0592 1622.7906 2964.8274 2975.0118 2976.7811 2978.7803 2992.0078 3026.5595 3045.8343 3056.2909 3058.5605 3068.6543 3082.9368 3089.4964 3125.3558 3127.2231 3136.2497 3167.5232
redmass: 3.9662 1.0459 2.7453 2.9463 3.2945 3.4265 2.2673 3.9703 1.9734 2.0848 1.1309 3.5338 1.9305 3.6597 3.6307 3.5652 3.3128 3.1922 4.8662 2.8325 4.2069 2.9414 4.1934 2.8410 4.6185 3.2255 1.7921 1.4567 3.3907 2.1324 2.0210 1.3585 1.3517 4.4943 1.9199 2.3928 1.5559 1.4602 2.0141 2.3455 1.2603 1.6413 1.6853 1.6213 1.2896 2.8983 2.2789 1.2782 1.5810 1.4353 1.7063 7.4727 1.2633 2.0807 1.5004 1.1369 1.1950 1.0841 1.0566 1.0470 1.2112 1.0500 1.1129 1.9355 1.0554 7.2420 6.3601 6.6960 1.0325 1.0369 1.0625 1.0370 1.0627 1.0957 1.0979 1.1043 1.0979 1.0990 1.0990 1.1001 1.0975 1.0919 1.0910 1.0933
irintensity: 2.4515 0.1967 0.6956 2.7889 1.6882 3.1449 1.5423 0.1647 0.2622 4.3853 0.0964 0.6577 6.4895 2.4266 2.0481 0.5580 9.9108 1.0251 4.8210 10.4502 3.6181 2.0265 5.4542 1.8272 15.0678 0.4637 21.3556 45.1325 5.4067 5.9827 10.5285 1.4824 3.1258 51.4893 5.4009 9.9301 12.8284 14.2652 7.8279 18.5906 0.1531 24.6435 32.1170 95.5797 2.7433 114.3602 20.2079 2.8071 70.6280 0.5049 34.6226 10.3048 34.5522 43.5451 43.2355 27.2694 5.9656 17.0966 17.6899 12.4513 103.6432 10.7489 12.5502 58.1094 12.1511 115.6045 26.7359 29.1317 68.6939 40.3698 35.8387 35.0998 29.4372 10.1338 8.7376 38.8967 21.0214 63.3843 19.3401 41.4330 30.5889 3.6012 6.2657 16.5430
temp: 298.150 k
press: 1.00000 atm
elementType: 8 8 6 6 6 6 6 6 6 6 6 6 6 6 1 1 1 1 1 1 1 1 1 1 1 1 1 1 1 1
symmnumber: 1
zpe: 654806.2 jmol-1
zpe.correction: 0.249403 hartree
zpe.thermalcorrener: 0.264660 hartree
zpe.thermalcorrenthalpy: 0.265605 hartree
zpe.thermalcorrgfe: 0.204195 hartree
zpe.sumelectzpe: -616.253695 hartree
zpe.sumelectthermal: -616.238437 hartree
zpe.sumelectthermalent: -616.237493 hartree
zpe.sumelectthermalfe: -616.298902 hartree
dipole: 2.8213 4.1916 0.7542
dipole: 5.1087
quadrupole: -78.1800 -75.1992 -86.9937
quadrupole: -3.8525 0.3425 -1.2714
quadrupole: 1.9443 4.9251 -6.8694 -3.8525 0.3425 -1.2714
hfenergy: -616.5030971 hartree
pointgroup: C01[X(C12H16O2)]
dipole: 1.2806331 1.4103369 -0.6407947 debye
polarizability: 177.4712638|-2.0161334|137.1532556|7.5140622|-35.8150397|104.4035592 unknown
InChI: InChI=1S/C12H16O2/c1-4-5-11(13)10-8-9(2)6-7-12(10)14-3/h6-8H,4-5H2,1-3H3
charge 0 multiplicity 1
30 atoms
O  0.031741 1.445674 -1.515722
O  -1.643867 -2.013051 0.290955
C  -2.278253 0.092829 -0.740416
C  0.223378 -0.590325 -0.200114
C  -3.743998 -0.306115 -0.47441
C  -1.257609 -0.90246 -0.189199
C  0.85005 0.536839 -0.825216
C  1.06013 -1.518285 0.476366
C  2.461447 -1.376896 0.567829
C  2.255943 0.69715 -0.745903
C  -4.162408 -0.134142 1.003077
C  3.044737 -0.247036 -0.056788
C  3.305866 -2.399518 1.308546
C  0.669493 2.588236 -2.177535
H  -2.082769 0.19432 -1.827653
H  -2.056809 1.098626 -0.333352
H  -3.892166 -1.360808 -0.771828
H  -4.398472 0.313367 -1.119122
H  0.553423 -2.375158 0.936077
H  2.746054 1.552456 -1.219301
H  -3.56401 -0.793846 1.654718
H  -5.227952 -0.391839 1.146795
H  -4.019087 0.911136 1.338876
H  4.130646 -0.100812 -0.008231
H  4.378892 -2.144075 1.26775
H  3.015678 -2.465485 2.373785
H  3.18316 -3.41018 0.87667
H  1.383773 2.255192 -2.954719
H  1.186578 3.240129 -1.44763
H  -0.158189 3.140474 -2.646303
