program: Gaussian 09
title: 000219473
version: EM64L-G09RevD.01
frameworkgroup: C1[X(C13H14O)]
method: RPBEPBE
basis: SDD
operation: Freq
keyword: #pfreq=noraman
keyword: PBEPBE/SDD
title: #p freq=noraman PBEPBE/SDD
converged: YES YES NO NO
title: Mulliken charges:
elementType: O C C C C C C C C C C C C C H H H H H H H H H H H H H H
charge: -0.227544 -0.258988 -0.571478 -0.549895 0.536284 0.489173 0.168088 -0.503083 -0.823644 -0.390801 -0.462701 -0.249795 -0.220439 -0.243613 0.234869 0.237146 0.236170 0.260938 0.232940 0.256017 0.241289 0.232567 0.234756 0.225466 0.234503 0.225182 0.226662 0.229931
chargesum: 0.00000
title: Mulliken charges with hydrogens summed into heavy atoms:
elementType: O C C C C C C C C C C C C C
charge: -0.227544 -0.024119 -0.098163 -0.056017 0.536284 0.489173 0.168088 -0.247065 -0.115031 -0.165335 -0.228198 -0.024613 0.006223 -0.013682
polarizability: 1.78883187e+02 -6.83344946e+00 1.24470640e+02 -1.86622937e+00 1.10745708e+00 1.12703553e+02
1716.lowfreq: -10.8406 -7.8380 -6.2800 -0.0004 -0.0003 0.0003 30.0132 75.7602 77.5566
frequency: 29.8582 75.7166 77.5251 102.8708 145.1845 184.8804 217.6128 249.7382 275.7023 309.4384 403.1408 410.3877 441.3242 463.6445 493.7792 534.6055 546.4691 591.6091 615.2432 633.4713 705.4388 767.0001 797.0752 824.6068 849.7899 873.2180 892.9371 905.0580 909.3666 921.9201 973.3225 990.3159 994.7368 1007.2906 1011.2115 1027.5318 1049.2947 1083.0674 1104.9118 1139.4908 1156.7681 1172.3274 1187.8319 1205.7845 1229.4313 1255.2265 1262.7741 1282.8301 1312.4378 1327.1083 1344.6357 1361.9657 1386.2867 1395.3574 1434.7342 1442.9248 1448.6360 1459.3254 1462.4393 1482.7023 1584.0685 1592.4789 1613.0320 1644.2251 2953.3651 2966.4704 2971.4934 2986.8614 3019.5631 3037.8917 3069.1159 3092.9650 3112.2000 3116.6723 3132.2181 3133.4255 3143.8555 3162.8971
redmass: 3.9569 3.7148 4.4994 2.4440 1.6364 1.7346 3.5904 3.6395 3.6001 3.6629 2.8173 3.4900 2.2836 3.6477 3.9699 2.9051 3.0139 4.2103 6.2118 4.2682 1.6824 1.9438 4.8346 1.4327 1.2505 2.5400 3.2726 1.4155 2.3945 1.6530 1.3907 6.0380 1.3227 1.6095 1.7001 2.0627 1.8693 1.5998 3.4750 1.2445 2.4508 1.0569 1.1111 1.6291 1.7531 1.9395 1.3245 1.8296 1.5301 1.2605 1.6946 2.1942 4.6658 1.2447 1.0855 2.0600 1.1050 1.0522 1.0810 2.2987 9.5127 5.9463 6.1680 6.2353 1.0639 1.0391 1.0688 1.0783 1.0954 1.0957 1.0952 1.0986 1.0871 1.0870 1.0903 1.0922 1.0956 1.1014
irintensity: 0.7237 0.9785 1.6474 1.5490 0.2695 0.7820 0.5753 0.9025 0.3684 4.1521 0.1042 3.9318 1.9789 10.9803 7.9881 1.9820 8.6833 0.1384 0.2265 4.4476 50.6614 45.5336 2.3722 2.6296 0.1118 3.8571 3.2897 16.1835 5.5057 0.6343 0.0664 0.3406 0.0141 5.3772 5.2825 6.5126 18.5014 5.5884 0.4280 6.9058 2.1761 0.0844 0.2023 2.2182 7.8114 69.3301 13.3936 27.4185 0.1299 0.9897 18.6316 35.6279 0.6511 29.7634 10.3234 6.2205 16.9506 11.4148 17.3823 18.3362 194.5573 1.7770 10.9210 107.0031 8.6146 22.5569 6.8574 22.9183 23.2084 18.0775 10.8562 24.1178 13.6689 7.3535 7.9922 14.0528 41.0457 24.4638
temp: 298.150 k
press: 1.00000 atm
elementType: 8 6 6 6 6 6 6 6 6 6 6 6 6 6 1 1 1 1 1 1 1 1 1 1 1 1 1 1
symmnumber: 1
zpe: 607548.1 jmol-1
zpe.correction: 0.231403 hartree
zpe.thermalcorrener: 0.243966 hartree
zpe.thermalcorrenthalpy: 0.244910 hartree
zpe.thermalcorrgfe: 0.191645 hartree
zpe.sumelectzpe: -577.990664 hartree
zpe.sumelectthermal: -577.978102 hartree
zpe.sumelectthermalent: -577.977157 hartree
zpe.sumelectthermalfe: -578.030422 hartree
dipole: -1.9522 4.4077 0.2352
dipole: 4.8265
quadrupole: -83.6698 -92.9307 -77.2014
quadrupole: 14.5820 0.3863 -0.1863
quadrupole: 0.9308 -8.3301 7.3992 14.5820 0.3863 -0.1863
hfenergy: -578.2220673 hartree
pointgroup: C01 [X(C13H14O1)]
dipole: -0.7974046 -1.6300938 -0.5591553 debye
polarizability: 179.0635093|4.9710754|122.8302259|4.0073944|3.9466561|114.1636458 unknown
InChI: InChI=1S/C13H14O/c1-10-7-12(9-13(14)8-10)11-5-3-2-4-6-11/h2-6,8,12H,7,9H2,1H3
charge 0 multiplicity 1
28 atoms
O  3.041554 2.310358 0.745535
C  0.224653 -0.071821 0.427531
C  0.928068 -1.167026 -0.420754
C  0.890883 1.303578 0.154366
C  -1.285649 -0.046875 0.200178
C  2.442777 -1.142182 -0.280855
C  2.406725 1.273547 0.379816
C  3.100732 -0.004269 0.112496
C  3.175031 -2.423693 -0.605283
C  -1.834608 0.272864 -1.070253
C  -2.177229 -0.346437 1.261142
C  -3.231579 0.292499 -1.272468
C  -3.577336 -0.327996 1.064319
C  -4.110073 -0.008343 -0.204814
H  0.407538 -0.319704 1.492984
H  0.665079 -1.035612 -1.492532
H  0.541461 -2.166778 -0.14142
H  0.45597 2.097091 0.786669
H  0.714906 1.603425 -0.899866
H  4.191625 0.009643 0.226961
H  4.269806 -2.303321 -0.552429
H  2.911042 -2.779128 -1.621017
H  2.87843 -3.231491 0.092752
H  -1.169029 0.51413 -1.908841
H  -1.770483 -0.592595 2.250103
H  -3.636632 0.543909 -2.259351
H  -4.248924 -0.56049 1.898561
H  -5.194439 0.008514 -0.360928
