program: Gaussian 09
title: 000219472
version: EM64L-G09RevD.01
frameworkgroup: C1[X(C6H5N3O2)]
method: RPBEPBE
basis: SDD
operation: Freq
keyword: #pfreq=noraman
keyword: PBEPBE/SDD
title: #p freq=noraman PBEPBE/SDD
converged: NO NO NO NO
title: Mulliken charges:
elementType: O O N N N C C C C C C H H H H H
charge: -0.122062 -0.154606 0.062617 -0.032160 -0.001496 0.467939 -0.390462 0.103695 -0.430026 -0.784882 0.028508 0.274017 0.259579 0.242842 0.241860 0.234634
chargesum: 0.00000
title: Mulliken charges with hydrogens summed into heavy atoms:
elementType: O O N N N C C C C C C
charge: -0.122062 -0.154606 0.062617 -0.032160 -0.001496 0.467939 -0.116445 0.103695 -0.170446 -0.065546 0.028508
polarizability: 1.49191921e+02 2.62370572e+00 1.03229260e+02 3.55473351e-02 6.65969001e-03 4.10425581e+01
1716.lowfreq: -8.5972 -0.0005 0.0001 0.0006 9.3382 12.2415 93.8119 111.0014 190.4308
frequency: 93.7962 110.9595 190.4264 237.4372 268.2085 322.0606 369.8021 372.3596 428.5973 451.7616 454.0406 552.1417 588.1459 621.6240 682.4280 755.0715 772.7822 783.6416 878.9538 935.4315 935.8435 979.8513 1012.1304 1052.8687 1153.1566 1181.5290 1267.2247 1312.3969 1367.6406 1403.4932 1414.2938 1449.4696 1462.9577 1465.8269 1498.0715 1603.5738 1614.2326 2983.1453 3062.0268 3099.1391 3127.9007 3168.6840
redmass: 1.3799 2.2952 5.5163 5.2106 5.3876 5.2615 7.1436 7.2180 5.1009 7.5749 5.8098 9.6359 3.6378 8.0713 8.5455 6.1301 7.0249 10.7076 1.3861 3.5449 1.4542 4.5808 1.7513 1.5677 7.0159 2.0824 6.2861 1.6705 2.3775 1.2479 8.7223 3.9157 1.4964 1.0514 2.8091 5.8682 13.8042 1.0377 1.0975 1.0990 1.0916 1.0939
irintensity: 0.7687 0.0110 0.4384 0.1414 0.8884 2.9107 0.0466 1.9049 0.0338 0.0925 1.1775 10.0883 9.2489 1.9354 5.0675 2.9611 1.8949 7.1311 24.1827 1.5359 0.1983 76.6119 7.0017 13.5138 9.8820 3.9025 1.6088 10.1648 5.0210 16.6580 2.6715 4.0106 12.2262 15.6251 10.2082 46.7339 322.7645 16.0514 13.4137 14.0361 10.4770 3.3509
temp: 298.150 k
press: 1.00000 atm
elementType: 8 8 7 7 7 6 6 6 6 6 6 1 1 1 1 1
symmnumber: 1
zpe: 284024.1 jmol-1
zpe.correction: 0.108179 hartree
zpe.thermalcorrener: 0.117146 hartree
zpe.thermalcorrenthalpy: 0.118090 hartree
zpe.thermalcorrgfe: 0.074107 hartree
zpe.sumelectzpe: -545.421416 hartree
zpe.sumelectthermal: -545.412449 hartree
zpe.sumelectthermalent: -545.411505 hartree
zpe.sumelectthermalfe: -545.455488 hartree
dipole: 6.2945 0.6002 0.0042
dipole: 6.3231
quadrupole: -60.4024 -68.9534 -62.6258
quadrupole: -0.5016 0.0032 0.0161
quadrupole: 3.5915 -4.9596 1.3680 -0.5016 0.0032 0.0161
hfenergy: -545.529595 hartree
pointgroup: C01 [X(C6H5N3O2)]
dipole: -2.4789053 0.2080979 0.0170415 debye
dipolederiv: -0.373162 -0.5448835 0.0693753 0.2534979 -0.0035153 -0.014284 -0.0246203 -0.0030505 -0.0853488 -0.9848471 0.503098 -0.0444317 0.6831187 -0.7179086 0.060077 -0.0624505 0.0609647 -0.114907 -0.2138283 0.0703049 -0.0080041 0.2300582 -0.2322746 0.0009879 -0.0253146 0.0047094 -0.1806574 0.0433005 0.4468199 -0.0551998 -0.0968464 -0.3496151 0.0246269 0.0095132 0.0186644 -0.1502321 1.2720413 -0.5826938 0.047753 -0.8179688 0.8905095 -0.0837952 0.0711718 -0.0863218 0.0556696 0.4957532 0.0076969 -0.0078176 -0.1188629 -0.2412911 0.03419 0.0116774 0.0329987 0.0231723 -0.0730574 0.0203786 -0.0036864 -0.133479 0.1579187 -0.03212 0.0142643 -0.0351673 -0.1249036 0.2135015 -0.1125256 0.0117231 0.0063902 0.0052595 0.0165877 -0.0032176 0.0173398 0.1391261 -0.0078179 -0.0605578 0.0056545 0.126179 0.4419902 -0.0645105 -0.0185264 -0.06075 -0.0739108 -0.2106626 -0.0320344 0.0072515 -0.0777565 0.048418 0.0023234 0.0050009 -0.0003401 0.057224 -0.3002734 0.3712439 -0.0364342 -0.1308131 -0.0657498 0.0235403 0.0222018 0.0145501 0.1128003 0.0627624 0.0363396 -0.0024955 0.0750675 0.0095046 0.0162309 -0.0069226 0.0168001 0.1543714 -0.0001111 -0.0869411 0.0127254 -0.0780903 0.0089421 0.0150084 0.0124302 0.0154788 0.1201403 0.0117951 -0.0255203 -0.0391969 -0.0304143 0.0583374 -0.1060003 -0.0873616 -0.0854772 -0.0033365 0.0186128 -0.013715 0.0414178 -0.0099254 0.0915845 0.0881 0.0917946 0.0669321 -0.0421907 0.0459929 0.0029897 0.0013654 0.1198451 -0.1021098 0.0190375 -0.0096405 0.0226689 0.1129828 unknown
polarizability: 149.2199717|-2.2397979|102.3265886|-1.5858778|-7.1877466|41.9171793 unknown
InChI: InChI=1S/C6H5N3O2/c1-4-2-5-6(7-3-4)9(10)11-8-5/h2-3H,1H3
charge 0 multiplicity 1
16 atoms
O  2.353174 1.16076 -0.15101
O  2.946808 -1.268056 0.120007
N  -0.133413 -1.554454 0.208359
N  1.138883 1.850966 -0.215687
N  2.01472 -0.433405 0.040221
C  -2.081223 -0.000712 0.060283
C  -1.266398 1.120458 -0.087392
C  0.153575 0.919063 -0.089241
C  -1.453571 -1.311621 0.204552
C  -3.591987 0.083751 0.076378
C  0.648682 -0.4312 0.060031
H  -1.677042 2.128044 -0.200287
H  -2.095803 -2.193401 0.323671
H  -4.031123 -0.500707 -0.753668
H  -4.003005 -0.328405 1.016664
H  -3.939879 1.125421 -0.01988
