program: Gaussian 09
title: 000219463
version: EM64L-G09RevD.01
frameworkgroup: C1[X(C10H16O4)]
method: RPBEPBE
basis: SDD
operation: Freq
keyword: #pfreq=noraman
keyword: PBEPBE/SDD
title: #p freq=noraman PBEPBE/SDD
converged: NO YES NO NO
title: Mulliken charges:
elementType: O O O O C C C C C C C C C C H H H H H H H H H H H H H H H H
charge: -0.428665 -0.418233 -0.226952 -0.230594 0.255070 0.286043 -0.195170 -0.541330 -0.496326 -0.766766 -0.752791 -0.790235 0.091588 0.102083 0.268475 0.274400 0.216964 0.224214 0.265263 0.229849 0.248281 0.226821 0.227255 0.243451 0.223310 0.222613 0.226418 0.260339 0.378816 0.375809
chargesum: 0.00000
title: Mulliken charges with hydrogens summed into heavy atoms:
elementType: O O O O C C C C C C C C C C
charge: -0.049849 -0.042424 -0.226952 -0.230594 0.255070 0.286043 0.073305 -0.049966 -0.006849 -0.061815 -0.058775 -0.080865 0.091588 0.102083
polarizability: 1.31244451e+02 1.10446147e+00 1.12758792e+02 1.24558983e-01 -4.27987434e+00 1.02461706e+02
1716.lowfreq: -9.1345 -0.0004 0.0003 0.0005 4.5702 14.1331 28.4724 56.6910 67.1314
frequency: 24.0109 56.6531 67.0943 84.5356 130.4255 190.4707 200.8765 233.0920 240.8925 251.7533 267.4932 275.9582 302.4516 325.6905 345.2898 384.3589 400.2782 407.7820 436.6762 522.1082 562.0869 578.0304 601.6287 619.6419 626.0856 654.0617 722.1124 733.9848 751.9996 825.5346 855.7346 886.1631 942.2408 945.7772 954.6047 985.0661 999.3688 1006.5926 1021.7117 1050.4664 1070.4316 1089.0555 1132.5519 1137.6830 1177.8769 1187.9897 1217.6833 1228.3852 1244.7532 1249.1163 1278.3445 1288.1638 1296.5147 1325.3971 1362.7331 1388.6168 1396.9489 1413.0737 1460.3502 1466.2075 1477.7551 1479.8415 1481.2196 1488.2645 1494.3807 1501.2865 1644.3036 1655.7473 2988.3101 2990.8163 2992.3995 3013.3313 3024.9414 3028.3522 3067.4214 3075.6686 3076.8271 3082.8003 3089.2220 3093.7549 3095.9396 3113.5280 3500.4355 3504.3938
redmass: 4.1451 7.2664 5.5228 3.2232 5.6865 3.8815 1.3876 1.4211 1.7869 3.0084 1.2453 2.6665 2.0258 3.1888 2.1683 2.7725 4.3297 3.8236 2.9735 3.5263 3.1349 2.3888 2.1820 1.5021 3.4695 1.9063 3.5700 4.6774 2.4022 1.6232 2.4844 2.5199 3.5484 1.4603 1.9888 1.7473 2.8017 1.3622 2.5388 2.7264 1.7773 2.0997 2.9174 1.8828 2.1652 2.3334 2.0575 1.9675 1.2792 1.5889 1.7147 1.4822 1.6218 1.6035 1.7290 1.2130 1.1876 1.1948 1.0527 1.0522 1.0546 1.0635 1.0575 1.0592 1.0606 1.0715 8.7635 8.0506 1.0361 1.0362 1.0368 1.0604 1.0715 1.0751 1.1026 1.0993 1.0989 1.0990 1.1021 1.0997 1.0996 1.0989 1.0638 1.0639
irintensity: 0.2098 0.7900 0.7308 0.1454 0.2906 0.0570 0.6174 0.1174 0.5828 0.6921 0.5346 2.3458 1.2834 4.9323 0.9377 1.2696 9.8849 5.0603 14.5572 9.1033 4.1668 57.9961 97.7891 57.7054 10.9506 73.7126 18.0982 23.1203 13.2006 4.4128 3.6354 1.9166 37.1989 0.5808 3.6594 17.6821 40.1577 1.5278 206.1291 178.2938 57.5101 4.9876 25.6091 20.6318 14.7995 10.9953 15.1795 9.4125 4.0207 1.4158 33.2628 10.7701 17.7732 1.7248 49.4256 4.8851 34.0006 16.2119 0.1440 7.5951 7.7863 19.8400 8.6105 6.0530 12.8901 8.4615 168.6093 246.0297 16.0973 25.2210 14.0113 14.4832 27.9526 19.4600 1.5351 2.4897 51.0593 12.9508 40.0447 27.2526 17.1074 14.4065 21.3327 22.8502
temp: 298.150 k
press: 1.00000 atm
elementType: 8 8 8 8 6 6 6 6 6 6 6 6 6 6 1 1 1 1 1 1 1 1 1 1 1 1 1 1 1 1
symmnumber: 1
zpe: 651029.3 jmol-1
zpe.correction: 0.247964 hartree
zpe.thermalcorrener: 0.262943 hartree
zpe.thermalcorrenthalpy: 0.263888 hartree
zpe.thermalcorrgfe: 0.206058 hartree
zpe.sumelectzpe: -690.476842 hartree
zpe.sumelectthermal: -690.461863 hartree
zpe.sumelectthermalent: -690.460919 hartree
zpe.sumelectthermalfe: -690.518748 hartree
dipole: 0.1820 -2.0234 1.7603
dipole: 2.6881
quadrupole: -82.1279 -85.6566 -85.7975
quadrupole: -0.3412 -0.8003 7.5012
quadrupole: 2.3994 -1.1293 -1.2701 -0.3412 -0.8003 7.5012
hfenergy: -690.7248063 hartree
pointgroup: C01 [X(C10H16O4)]
dipole: 0.0902305 0.6979209 -0.7894474 debye
polarizability: 131.2052806|-1.3479119|111.5158584|0.2253596|-5.4786802|103.7438097 unknown
InChI: InChI=1S/C10H16O4/c1-9(2)6(7(11)12)4-5-10(9,3)8(13)14/h6,11,13H,4-5H2,1-3H3
charge 0 multiplicity 1
30 atoms
O  2.961588 1.254464 0.088081
O  -3.252209 1.113173 -0.593078
O  2.900245 -0.703678 1.310529
O  -3.170789 -0.509588 1.057911
C  -0.092972 0.58419 0.050132
C  1.154893 -0.305354 -0.426529
C  -1.281943 -0.286112 -0.537365
C  0.680697 -1.770055 -0.171989
C  -0.870774 -1.767698 -0.318781
C  -0.155652 0.636679 1.600395
C  -0.101962 2.022852 -0.510478
C  1.499553 -0.097256 -1.928192
C  2.39402 0.007595 0.414208
C  -2.626467 0.04497 0.076668
H  -1.354681 -0.050695 -1.614643
H  0.984184 -2.092599 0.837674
H  1.164916 -2.459596 -0.885684
H  -1.210054 -2.393708 -1.162498
H  -1.357236 -2.157765 0.591514
H  -1.073504 1.151971 1.934366
H  -0.150012 -0.365776 2.061054
H  0.703437 1.203632 2.002549
H  -0.981887 2.572233 -0.131492
H  0.809604 2.564991 -0.204565
H  -0.159863 2.036599 -1.612779
H  2.321006 -0.775468 -2.222883
H  0.62866 -0.337615 -2.563684
H  1.820381 0.934488 -2.138745
H  3.756686 1.400772 0.670204
H  -4.122264 1.305554 -0.146696
