program: Gaussian 09
title: 000219460
version: EM64L-G09RevD.01
frameworkgroup: C1[X(C9H18O4)]
method: RPBEPBE
basis: SDD
operation: Freq
keyword: #pfreq=noraman
keyword: PBEPBE/SDD
title: #p freq=noraman PBEPBE/SDD
converged: YES YES NO NO
title: Mulliken charges:
elementType: O O O O C C C C C C C C C H H H H H H H H H H H H H H H H H H
charge: -0.265669 -0.275957 -0.255706 -0.246383 0.307839 -0.034128 -0.719771 -0.720604 -0.221235 -0.207867 -0.680594 -0.682246 0.018088 0.200347 0.212731 0.259662 0.244824 0.256448 0.258350 0.205515 0.226771 0.202556 0.215213 0.192360 0.205076 0.226631 0.216510 0.206261 0.226812 0.228509 0.199659
chargesum: 0.00000
title: Mulliken charges with hydrogens summed into heavy atoms:
elementType: O O O O C C C C C C C C C
charge: -0.265669 -0.275957 -0.255706 -0.246383 0.307839 0.166219 -0.002555 -0.000291 0.208092 0.199705 -0.032377 -0.020664 0.217747
polarizability: 1.25361836e+02 2.83873681e-01 1.09876419e+02 -3.64107390e-01 -4.44402094e+00 1.02223191e+02
1716.lowfreq: -11.3433 -5.0362 0.0002 0.0003 0.0005 5.5465 33.9865 41.2135 55.3433
frequency: 33.5150 41.0987 55.2433 75.1767 88.7336 97.3414 123.9987 170.2262 183.2178 202.4116 221.3738 233.1454 234.2106 247.4424 255.7119 259.9859 302.1436 314.0351 355.4287 381.9475 429.8707 509.2506 529.8021 650.3669 678.1353 754.0482 783.6335 805.3405 809.5792 845.1071 895.9215 927.5055 934.3016 960.1746 963.3155 1008.2968 1016.1115 1033.2299 1059.3863 1099.6918 1108.1632 1113.0000 1136.2357 1140.6765 1157.4873 1214.2260 1246.4308 1249.3350 1252.2356 1308.4164 1341.9484 1355.9823 1357.1620 1372.3741 1379.4497 1391.2751 1395.0268 1399.3483 1458.5861 1459.2169 1459.9497 1467.4061 1473.1640 1476.6115 1480.7568 1486.8288 1488.5872 1494.0658 1615.6108 2945.1252 2956.3313 2986.3451 2992.9193 2993.9012 2998.6634 3002.5904 3013.6438 3015.7347 3055.5715 3084.2660 3091.3652 3093.1132 3095.6055 3097.2104 3100.4398 3122.9916 3129.2284
redmass: 2.7469 2.4046 3.9170 2.8449 1.9665 3.6604 2.9544 1.1900 3.4282 1.8785 3.6386 1.4584 1.2353 1.9709 2.7429 1.7774 2.8735 3.1124 2.8244 3.2682 3.5357 3.7255 3.9462 4.3917 5.3522 5.4531 3.3840 1.1023 1.1215 2.9713 2.2014 2.5707 1.4611 4.1745 1.6014 2.1621 1.4751 3.0447 5.2575 4.9253 2.6463 2.1371 1.4535 1.5449 2.1055 3.9251 1.2361 2.0216 1.1472 1.2890 1.1904 1.1656 1.2447 1.3128 1.2131 1.2586 1.2454 1.2576 1.0425 1.0419 1.0480 1.0495 1.0597 1.0656 1.0462 1.0545 1.0748 1.0805 8.0955 1.0618 1.0829 1.0361 1.0573 1.0374 1.0378 1.0379 1.0899 1.1009 1.1040 1.0987 1.0990 1.0960 1.1021 1.0958 1.1011 1.1016 1.1016
irintensity: 0.0599 0.1190 0.6416 0.3828 1.7308 0.7887 7.4437 1.3629 8.5232 2.6425 0.4376 3.7568 0.3360 4.6330 3.6596 5.8190 0.6859 5.3247 16.4770 4.5912 7.3259 10.4739 8.3413 1.5245 7.7699 8.3246 7.5869 5.3027 3.1303 6.7120 8.1866 12.4516 6.0337 204.9857 1.5994 26.7585 35.1958 73.8587 264.9838 209.4671 73.9414 10.2868 7.3998 9.7858 14.6876 14.3715 2.7224 21.0317 1.5036 16.2659 0.9403 9.0301 0.4657 6.7909 26.8456 21.4043 50.9961 20.4387 10.4121 10.0196 1.5590 1.4281 10.2338 28.7037 6.0639 10.3642 16.9416 3.6652 283.3593 44.4881 58.2212 31.8013 37.6761 18.0454 11.3902 29.3229 56.1780 34.5100 7.4820 37.2776 33.9886 8.4356 54.2010 28.3936 38.6590 7.3654 9.9115
temp: 298.150 k
press: 1.00000 atm
elementType: 8 8 8 8 6 6 6 6 6 6 6 6 6 1 1 1 1 1 1 1 1 1 1 1 1 1 1 1 1 1 1
symmnumber: 1
zpe: 685604.1 jmol-1
zpe.correction: 0.261133 hartree
zpe.thermalcorrener: 0.277776 hartree
zpe.thermalcorrenthalpy: 0.278720 hartree
zpe.thermalcorrgfe: 0.216429 hartree
zpe.sumelectzpe: -653.548326 hartree
zpe.sumelectthermal: -653.531684 hartree
zpe.sumelectthermalent: -653.530739 hartree
zpe.sumelectthermalfe: -653.593030 hartree
dipole: 2.8115 -0.1376 0.3253
dipole: 2.8336
quadrupole: -87.7331 -76.8472 -76.0054
quadrupole: -3.9900 -2.6771 -5.3124
quadrupole: -7.5378 3.3480 4.1898 -3.9900 -2.6771 -5.3124
hfenergy: -653.8094592 hartree
pointgroup: C01 [X(C9H18O4)]
dipole: 1.096151 -0.1694026 -0.112298 debye
polarizability: 124.6282881|-3.2531375|110.7148389|-0.2186274|-4.3888998|102.1183187 unknown
InChI: InChI=1S/C9H18O4/c1-5-11-8(12-6-2)9(3,4)13-7-10/h7-8H,5-6H2,1-4H3
charge 0 multiplicity 1
31 atoms
O  0.699208 -1.328447 -0.833381
O  1.268218 0.796108 0.178186
O  -1.351562 0.090014 0.842936
O  -3.563594 0.919535 0.889678
C  -1.033862 0.53279 -0.577444
C  0.449198 0.107391 -0.797412
C  -1.94632 -0.221731 -1.561776
C  -1.162281 2.064582 -0.68525
C  0.597282 -2.069331 0.453531
C  2.712536 0.777803 -0.150181
C  1.499285 -3.297324 0.327455
C  3.439074 1.52452 0.966253
C  -2.584258 0.346177 1.409958
H  0.724225 0.413973 -1.831108
H  -1.671158 0.044229 -2.598707
H  -2.999996 0.053752 -1.39918
H  -1.821485 -1.311319 -1.450772
H  -0.553052 2.550675 0.093208
H  -2.214068 2.374669 -0.587462
H  -0.788252 2.396969 -1.671345
H  0.907426 -1.40459 1.280076
H  -0.457419 -2.358733 0.620435
H  3.058491 -0.271332 -0.233624
H  2.86541 1.271922 -1.134443
H  1.4300 -3.9181 1.240161
H  1.198491 -3.915537 -0.536583
H  2.553283 -2.999491 0.185928
H  4.526308 1.547239 0.768143
H  3.075109 2.563648 1.042397
H  3.270631 1.028207 1.937546
H  -2.563769 -0.056168 2.442774
