program: Gaussian 09
title: 000219458
version: EM64L-G09RevD.01
frameworkgroup: C1[X(C10H20N2)]
method: RPBEPBE
basis: SDD
operation: Freq
keyword: #pfreq=noraman
keyword: PBEPBE/SDD
title: #p freq=noraman PBEPBE/SDD
converged: NO YES NO NO
title: Mulliken charges:
elementType: N N C C C C C C C C C C H H H H H H H H H H H H H H H H H H H H
charge: -0.118178 -0.280311 -0.024454 -0.037778 -0.484054 -0.458686 -0.439155 -0.500269 -0.386407 -0.377866 -0.410581 -0.651161 0.192161 0.219621 0.216100 0.210919 0.207379 0.205523 0.202702 0.222957 0.250016 0.169672 0.171766 0.224661 0.189027 0.206044 0.170377 0.209284 0.258605 0.222060 0.185468 0.234557
chargesum: 0.00000
title: Mulliken charges with hydrogens summed into heavy atoms:
elementType: N N C C C C C C C C C C
charge: -0.118178 -0.021705 0.167708 0.181843 -0.057036 -0.045784 -0.013497 -0.080580 0.010020 0.017204 -0.030919 -0.009077
polarizability: 1.37287489e+02 9.67045723e-01 1.09544053e+02 -2.02593921e+00 -7.52817295e-01 1.03234284e+02
1716.lowfreq: -15.9190 -8.8511 -0.0009 -0.0006 -0.0005 10.4652 42.7126 77.5239 100.9976
frequency: 41.7712 77.4464 100.9049 157.7593 177.5258 221.1876 226.9934 250.7524 268.2048 312.9633 339.9670 393.5329 429.9211 453.1268 486.2912 555.8393 614.9672 621.1905 675.8235 758.6646 802.4039 846.2094 854.8475 873.4403 876.6138 917.9093 923.3880 936.3078 966.5441 985.0617 1025.8872 1045.7843 1052.7570 1066.7892 1102.9378 1107.3294 1123.0476 1134.6008 1138.7282 1154.2811 1160.3283 1185.4071 1198.0299 1210.7588 1223.4818 1236.8628 1261.1962 1267.9052 1274.4879 1285.6783 1295.3377 1300.9085 1319.7293 1326.5371 1338.0777 1339.4035 1355.5789 1359.9183 1382.9892 1432.6460 1444.7332 1454.4276 1459.8438 1463.2319 1464.9303 1469.1447 1472.8831 1479.7368 1481.3215 1489.5257 2784.1390 2829.4697 2830.6582 2848.4719 2848.6999 2957.5992 2971.5506 2983.2001 3008.1606 3017.9215 3019.3291 3023.3956 3028.6958 3034.7328 3048.6134 3053.8583 3060.5753 3077.9684 3086.0451 3450.0007
redmass: 2.6800 2.8216 2.8371 2.7163 1.7733 1.4486 1.8492 2.2080 2.3831 2.6480 2.0188 2.3202 3.1008 2.4539 1.8260 3.1547 2.5929 2.2971 1.7922 2.0895 2.2856 2.1783 1.5853 1.9147 1.9418 2.1206 2.2486 2.0491 1.9009 1.8276 2.1722 1.9266 1.6365 1.6174 2.2189 1.2886 2.2016 1.5655 1.6375 2.4138 2.1246 1.5963 1.6840 1.3358 1.7684 1.8299 1.2874 1.2886 1.2896 1.3243 1.2281 1.2527 1.2890 1.4670 1.4330 1.4392 1.4837 1.4200 1.4680 1.1683 1.2997 1.1132 1.0992 1.0749 1.0803 1.0567 1.0920 1.0574 1.0781 1.0996 1.0803 1.0696 1.0712 1.0616 1.0666 1.0603 1.0810 1.0618 1.0598 1.0837 1.0822 1.0714 1.0880 1.0828 1.1032 1.0895 1.1038 1.1005 1.1050 1.0752
irintensity: 0.3442 0.7005 0.1758 0.6136 1.3191 1.2608 0.4149 0.0895 0.7970 7.3534 2.3086 1.1115 16.4164 3.0734 29.8588 3.3252 2.6496 37.0811 60.0411 0.7101 0.9808 7.5051 5.4379 20.7691 0.4338 2.3382 3.3031 4.1951 5.3222 5.8757 7.3751 12.8283 17.0136 2.4776 1.3154 5.5098 1.6754 1.7919 2.6139 11.3380 34.3390 6.0551 18.6205 4.4351 10.2223 5.7486 0.6705 5.8659 1.8931 4.9373 2.6508 4.2268 22.3413 7.1566 2.0227 0.7522 6.3555 1.8565 0.6595 4.3097 5.5413 8.9987 5.3894 3.0106 8.0620 15.0642 5.0512 12.2438 6.2328 4.2038 70.3216 92.4936 93.5167 115.4014 206.8535 29.1965 34.4341 32.5809 30.8781 45.1699 56.3533 41.7288 82.1320 53.1011 58.5007 29.5885 7.3482 34.3589 67.1162 2.7810
temp: 298.150 k
press: 1.00000 atm
elementType: 7 7 6 6 6 6 6 6 6 6 6 6 1 1 1 1 1 1 1 1 1 1 1 1 1 1 1 1 1 1 1 1
symmnumber: 1
zpe: 762606.4 jmol-1
zpe.correction: 0.290461 hartree
zpe.thermalcorrener: 0.302562 hartree
zpe.thermalcorrenthalpy: 0.303506 hartree
zpe.thermalcorrgfe: 0.252427 hartree
zpe.sumelectzpe: -501.553608 hartree
zpe.sumelectthermal: -501.541508 hartree
zpe.sumelectthermalent: -501.540564 hartree
zpe.sumelectthermalfe: -501.591642 hartree
dipole: 0.3883 -0.7950 0.0290
dipole: 0.8852
quadrupole: -72.6941 -76.2455 -73.6724
quadrupole: 1.7176 2.6670 -0.2748
quadrupole: 1.5099 -2.0415 0.5316 1.7176 2.6670 -0.2748
hfenergy: -501.8440694 hartree
pointgroup: C01 [X(C10H20N2)]
dipole: 0.1461814 -0.3159855 0.0086441 debye
polarizability: 137.3436723|0.421012|109.5322004|-1.7859095|-0.6313134|103.1899533 unknown
InChI: InChI=1S/C10H20N2/c1-12-7-3-5-10(12)9-4-2-6-11-8-9/h9-11H,2-8H2,1H3
charge 0 multiplicity 1
32 atoms
N  1.879728 0.698488 -0.017432
N  -2.366774 0.993968 -1.057727
C  0.908264 -0.27562 0.566134
C  -0.563435 0.183002 0.422246
C  1.288255 -1.6334 -0.113526
C  -1.551317 -0.843726 1.035368
C  2.685904 -1.3905 -0.771891
C  -0.970572 0.4983 -1.035652
C  3.149863 -0.050178 -0.163616
C  -3.012214 -0.34711 0.911609
C  -3.342452 0.000449 -0.556559
C  2.005213 1.96919 0.712373
H  1.10316 -0.37856 1.670191
H  -0.688332 1.130343 0.987564
H  0.544105 -1.934153 -0.870759
H  1.326391 -2.438128 0.64123
H  -1.297786 -1.032561 2.097848
H  -1.45101 -1.812746 0.503486
H  3.401736 -2.208383 -0.577596
H  2.579216 -1.283127 -1.865294
H  -0.296555 1.270655 -1.444949
H  -0.839935 -0.423377 -1.659307
H  3.647878 -0.223887 0.827221
H  3.859141 0.501218 -0.807339
H  -3.716371 -1.117474 1.281995
H  -3.14885 0.562533 1.527841
H  -3.331797 -0.94859 -1.154969
H  -4.359209 0.429565 -0.629588
H  -2.630231 1.373053 -1.976152
H  2.76252 2.60597 0.220651
H  2.310217 1.830418 1.782271
H  1.046947 2.516967 0.69893
