program: Gaussian 09
title: 000219457
version: EM64L-G09RevD.01
frameworkgroup: C1[X(C14H24O4)]
method: RPBEPBE
basis: SDD
operation: Freq
keyword: #pfreq=noraman
keyword: PBEPBE/SDD
title: #p freq=noraman PBEPBE/SDD
converged: YES YES NO NO
title: Mulliken charges:
elementType: O O O O C C C C C C C C C C C C C C H H H H H H H H H H H H H H H H H H H H H H H H
charge: -0.426131 -0.425960 -0.206366 -0.206804 0.018120 -0.496369 -0.497693 -0.474524 -0.428234 -0.433400 -0.423896 0.169454 -0.409384 -0.382199 0.099721 0.102414 -0.352727 -0.701395 0.209996 0.196742 0.222528 0.198539 0.226204 0.219798 0.227424 0.206762 0.213230 0.216531 0.204320 0.232868 0.232128 0.213902 0.229185 0.216006 0.214251 0.197817 0.193216 0.213129 0.215689 0.213775 0.380658 0.380678
chargesum: 0.00000
title: Mulliken charges with hydrogens summed into heavy atoms:
elementType: O O O O C C C C C C C C C C C C C C
charge: -0.045473 -0.045281 -0.206366 -0.206804 0.228116 -0.077099 -0.072950 -0.027302 -0.008242 -0.012549 0.041100 0.169454 0.033702 0.048057 0.099721 0.102414 0.038306 -0.058802
polarizability: 1.86723722e+02 2.61561033e+00 1.50710916e+02 -2.65605848e+00 1.61036030e-01 1.41160900e+02
1716.lowfreq: -34.5547 -1.9332 0.0002 0.0006 0.0006 7.8843 10.3627 25.8617 31.1493
frequency: -33.9220 25.7423 31.0050 44.5375 48.7657 58.0793 67.6202 74.6099 109.0741 112.7713 137.1857 143.4740 176.4547 193.6540 218.8857 226.4160 240.6158 258.4712 300.5459 337.0182 360.4678 370.8151 415.5421 450.0062 468.3312 552.5384 565.3701 572.7582 611.8800 618.4062 633.6253 678.7580 722.0660 729.4321 742.3457 755.0149 763.6350 780.6800 811.6780 848.7354 868.5039 890.9900 896.1069 926.9517 947.3778 950.5995 967.3859 981.9709 1004.9291 1039.1246 1043.8406 1051.3388 1055.0506 1065.9166 1076.7468 1084.3889 1101.9686 1112.3557 1124.0416 1137.2814 1176.8904 1183.3291 1196.2947 1221.1481 1225.0366 1236.4923 1256.5986 1259.9225 1271.1515 1277.3124 1280.1122 1289.0967 1293.9485 1300.2016 1301.6723 1304.1796 1315.1491 1332.1126 1343.0284 1344.8220 1355.3535 1369.0613 1393.0677 1449.2101 1462.3700 1463.8152 1467.0126 1469.2031 1472.2065 1475.3803 1476.6849 1477.4461 1487.6780 1491.7208 1642.5013 1677.5239 2945.4250 2962.8638 2970.5605 2974.2527 2975.3619 2981.0651 2983.4067 2991.1558 2991.4826 2997.6134 3006.4787 3008.2496 3030.0992 3035.1656 3037.5919 3049.5337 3052.7586 3061.4677 3066.4434 3072.5079 3072.7695 3075.1885 3512.6426 3513.9366
redmass: 1.7238 4.0248 3.4563 4.2301 3.1370 3.2011 2.1075 6.8239 3.8850 3.6042 3.0559 3.5702 5.5651 2.3736 3.4648 1.1328 3.7039 2.2137 2.9850 5.6931 3.2994 6.1252 2.5717 2.4953 3.7426 2.8549 2.6744 2.3990 1.6387 2.6186 1.4765 3.5373 1.7457 1.4755 2.8374 1.9574 1.3282 1.3094 1.5691 2.5198 2.4320 2.4376 1.8446 1.4550 1.8543 1.8760 1.5508 3.2274 1.7415 2.8557 2.4627 2.1334 2.8182 3.1155 2.9402 2.6597 1.9877 2.7135 1.9194 1.9528 1.4772 1.5253 1.5278 1.4075 1.2000 1.3936 1.2355 1.3920 1.3495 1.4400 1.2483 1.4224 1.2612 1.1166 1.3248 1.3398 1.3977 1.4305 1.5006 1.6645 1.5630 1.5115 1.2160 1.0753 1.0842 1.0841 1.0752 1.0911 1.0853 1.0831 1.0642 1.0457 1.0813 1.1000 9.4782 9.2210 1.0824 1.0589 1.0628 1.0365 1.0610 1.0613 1.0600 1.0602 1.0614 1.0594 1.0993 1.0658 1.0996 1.0980 1.1007 1.0985 1.1036 1.1037 1.1031 1.1012 1.0994 1.1047 1.0639 1.0639
irintensity: 0.0119 0.6970 0.1527 0.0403 0.6324 0.0997 0.1381 1.0835 0.2671 0.0092 0.0595 0.0789 0.5566 0.1528 0.0781 0.0146 0.8614 0.0277 1.5481 2.6726 0.5678 2.2587 1.4421 1.6957 9.2796 18.2864 54.3774 48.6822 48.8728 6.6886 191.2497 2.4042 6.9240 15.9282 9.6993 3.0995 13.0081 0.7723 0.9936 2.5859 8.4118 7.5971 3.1506 1.8019 133.6092 10.0951 1.6630 3.9076 134.7999 2.7340 101.4382 80.2547 23.8010 4.0421 4.3132 4.8821 1.1345 2.7779 9.3734 10.1504 0.8292 10.9687 6.5755 1.0858 2.0101 0.0244 8.0444 0.8412 1.5775 6.2486 2.2871 1.6655 2.6249 0.8296 1.6297 1.8154 4.6147 1.6149 11.7748 21.2334 3.8540 1.9451 11.5100 0.7346 1.9133 0.0968 0.3775 3.2577 7.2201 13.0920 7.7067 11.6933 14.5743 2.5717 89.0358 297.9365 10.5625 28.3359 29.3547 35.3124 6.1606 57.2246 5.4370 30.9306 37.3126 36.9316 7.6320 58.8638 10.7411 36.9311 7.2264 11.6093 12.8546 0.3777 20.4489 100.0349 51.4996 127.7373 34.6731 23.2838
temp: 298.150 k
press: 1.00000 atm
elementType: 8 8 8 8 6 6 6 6 6 6 6 6 6 6 6 6 6 6 1 1 1 1 1 1 1 1 1 1 1 1 1 1 1 1 1 1 1 1 1 1 1 1
symmnumber: 1
zpe: 944993.9 jmol-1
zpe.correction: 0.359929 hartree
zpe.thermalcorrener: 0.379737 hartree
zpe.thermalcorrenthalpy: 0.380682 hartree
zpe.thermalcorrgfe: 0.309394 hartree
zpe.sumelectzpe: -847.357689 hartree
zpe.sumelectthermal: -847.337881 hartree
zpe.sumelectthermalent: -847.336937 hartree
zpe.sumelectthermalfe: -847.408224 hartree
dipole: 0.6292 -2.0718 -2.1427
dipole: 3.0462
quadrupole: -110.3808 -110.0259 -108.7342
quadrupole: 4.0623 2.9097 -12.2667
quadrupole: -0.6672 -0.3123 0.9795 4.0623 2.9097 -12.2667
hfenergy: -847.7176183 hartree
pointgroup: C01 [X(C14H24O4)]
dipole: 0.2548818 -0.7757241 -0.8772895 debye
polarizability: 186.7106647|2.9231045|150.7086309|-2.3788941|0.5786641|141.176242 unknown
InChI: InChI=1S/C14H24O4/c1-2-3-9-14(12(15)16,13(17)18)10-8-11-6-4-5-7-11/h11,15,17H,2-10H2,1H3
charge 0 multiplicity 1
42 atoms
O  -1.250644 -1.437202 1.770248
O  -0.661051 2.19413 -1.367681
O  -0.583661 0.669496 2.455805
O  -1.985532 2.422952 0.515594
C  3.0410 0.095618 -0.521348
C  3.414266 -1.397597 -0.304369
C  4.272041 0.832961 0.06764
C  1.699928 0.529105 0.109863
C  4.953068 -1.478116 -0.548317
C  5.491527 -0.012564 -0.391976
C  0.489951 -0.190691 -0.524788
C  -0.924545 0.220508 0.025421
C  -2.01878 -0.590451 -0.760298
C  -3.482031 -0.358545 -0.326636
C  -0.924559 -0.090399 1.528491
C  -1.23693 1.708825 -0.179685
C  -4.462552 -1.242376 -1.132146
C  -5.933601 -1.029222 -0.71576
H  3.003333 0.295778 -1.61477
H  3.1754 -1.674907 0.743011
H  2.851334 -2.085723 -0.960918
H  4.196368 0.833053 1.174111
H  4.33541 1.887462 -0.25776
H  1.740309 0.335291 1.200203
H  1.577945 1.623065 -0.012961
H  5.434949 -2.17081 0.164984
H  5.169131 -1.862567 -1.5621
H  5.868823 0.360962 -1.362416
H  6.330275 0.049796 0.324354
H  0.582246 -1.284456 -0.382675
H  0.482985 0.002965 -1.613464
H  -1.900929 -0.341957 -1.833769
H  -1.77135 -1.661585 -0.64095
H  -3.763566 0.70511 -0.451326
H  -3.590301 -0.588274 0.751231
H  -4.189353 -2.308778 -0.996068
H  -4.348012 -1.026422 -2.214546
H  -6.07953 -1.266421 0.354832
H  -6.617282 -1.67124 -1.301002
H  -6.241144 0.022242 -0.869387
H  -1.156545 -1.612907 2.7458
H  -0.95839 3.135392 -1.498569
