program: Gaussian 09
title: 000219448
version: EM64L-G09RevD.01
frameworkgroup: C1[X(C22H19NO2)]
method: RPBEPBE
basis: SDD
operation: Freq
keyword: #p
keyword: freq=noraman
keyword: PBEPBE/SDD
title: #p freq=noraman PBEPBE/SDD
converged: YES YES NO NO
title: Mulliken charges:
elementType: O O N C C C C C C C C C C C C C C C C C C C C C C H H H H H H H H H H H H H H H H H H H
charge: -0.238945 -0.221708 -0.002128 -0.232763 -0.589717 -0.591542 0.485705 0.147483 0.115497 -0.354749 -0.321119 0.293671 0.301473 -0.342729 -0.361472 -0.336736 -0.351588 -0.349395 -0.350597 -0.247260 -0.248717 -0.228266 -0.231232 -0.222022 -0.222946 0.277462 0.247421 0.290609 0.234413 0.236829 0.260496 0.224536 0.239741 0.237064 0.250593 0.242344 0.276493 0.278183 0.232472 0.233809 0.234288 0.234968 0.234538 0.235544
chargesum: 0.00000
title: Mulliken charges with hydrogens summed into heavy atoms:
elementType: O O N C C C C C C C C C C C C C C C C C C C C C C
charge: -0.238945 -0.221708 -0.002128 0.044700 -0.051687 -0.120301 0.485705 0.147483 0.115497 -0.094253 -0.096583 0.293671 0.301473 -0.102988 -0.124408 -0.086143 -0.109244 -0.072902 -0.072413 -0.014787 -0.014908 0.006021 0.003736 0.012516 0.012597
polarizability: 2.60321234e+02 2.71769980e+00 2.43785444e+02 -3.03369716e+01 -1.41626260e+01 2.22738308e+02
1716.lowfreq: -7.7357 -5.0437 -0.0007 -0.0003 0.0005 2.0434 11.7947 15.1423 23.2744
frequency: 11.3361 14.6712 23.2476 27.4420 37.0950 39.2330 69.6447 83.5690 86.8799 140.7264 150.2696 168.0576 179.5160 214.3719 229.4153 254.9154 308.1961 343.7992 366.8777 373.1038 400.4583 400.6874 414.0872 416.3562 451.5849 465.8266 484.2250 537.6187 560.9389 588.8038 608.0877 613.1384 613.2470 647.4063 661.9692 686.3414 696.1486 699.1260 735.3791 751.3475 762.5001 773.5902 792.8743 817.1823 826.0277 859.1512 859.2632 882.0580 885.5518 934.5462 947.0292 959.1079 962.6051 969.7502 975.3247 986.1777 989.3602 989.9901 992.3029 992.3323 1009.9196 1011.1023 1011.9494 1021.6641 1030.2306 1037.2881 1063.5110 1079.0071 1086.0819 1088.2073 1089.0987 1150.9526 1173.9723 1174.3694 1184.9675 1189.3256 1193.9856 1209.5814 1222.7226 1235.4400 1255.0182 1281.6813 1299.3687 1302.2194 1314.7291 1318.7333 1323.1495 1343.2312 1367.2393 1387.8373 1388.1285 1407.7413 1435.0384 1435.7736 1439.3026 1464.8325 1466.5243 1480.6289 1482.6544 1554.0307 1557.9197 1567.4776 1583.8084 1593.5724 1597.4750 1610.0429 1611.9158 2967.3182 3013.2499 3019.4685 3033.4538 3079.8749 3122.0326 3129.9594 3130.3807 3131.8059 3139.3218 3139.7393 3146.2624 3150.1484 3150.7429 3159.7941 3160.2206 3164.0511 3170.4158 3170.4783
redmass: 4.0855 5.5558 6.9802 5.2936 4.0561 3.9176 8.0916 6.9667 5.4191 5.7154 5.1674 5.0694 5.1641 4.7813 3.4025 4.3189 5.6291 4.5486 2.5002 4.3103 2.8081 2.8112 3.2331 4.5700 3.9878 4.3360 3.7588 3.8263 2.5290 3.5541 4.7783 6.4207 6.4054 6.5379 6.9347 4.7092 1.8069 1.6582 4.2926 2.9428 1.9490 2.5924 3.1294 2.9678 1.5279 1.2506 1.2508 1.2571 2.5437 1.5647 1.4520 2.2613 2.3288 1.9960 1.5926 3.3579 5.5050 5.1772 1.4498 1.4268 2.6278 1.4664 1.4362 2.6136 1.9538 2.8503 2.2373 2.3723 1.6184 1.7018 1.6689 1.3772 1.0664 1.0698 1.2185 1.1275 1.2918 1.8824 1.3459 2.0290 1.5595 2.7461 1.4259 2.6114 1.3751 1.4165 1.8829 1.5703 1.3154 9.0148 9.2370 1.9724 2.1717 2.0098 1.2105 1.2838 1.9694 2.1747 1.7562 6.6687 7.2726 6.9195 5.5894 6.5311 6.7350 6.2178 6.3137 1.0626 1.0711 1.0740 1.0929 1.1035 1.0870 1.0852 1.0852 1.0893 1.0879 1.0881 1.0968 1.0924 1.0925 1.0960 1.0961 1.0968 1.1013 1.1013
irintensity: 0.6992 0.5502 1.3133 1.4064 0.3184 0.2788 3.2531 2.8085 0.9127 2.2706 0.3963 0.9290 3.7627 2.9991 11.8854 2.8405 4.0671 1.0006 0.3217 1.5292 0.0525 0.0941 1.0191 0.2228 6.1019 2.4765 0.6495 13.9020 27.6317 24.8159 24.2031 0.4379 1.3725 4.9086 0.6629 0.9494 46.4591 65.9599 4.9434 7.9589 89.2895 27.5657 13.9673 7.2670 33.6045 0.9294 0.4817 0.5286 22.2791 2.7406 1.5568 2.6484 1.9729 3.7163 1.1599 40.6690 1.1291 11.1960 0.9722 2.2354 25.4764 2.7370 2.9074 2.4793 2.8960 0.8263 4.2293 10.9669 6.8588 6.8508 9.4539 4.8437 5.0432 3.3186 53.2523 23.4762 17.3402 35.5448 24.1421 96.4667 27.9111 134.3740 103.1949 37.2622 14.2950 15.0521 22.3712 43.3349 4.6029 3.2616 2.8395 24.3827 23.2014 18.1387 24.5827 8.4802 10.5435 1.7194 9.3069 14.3581 133.0123 94.2280 64.9317 28.5043 31.5476 12.9444 7.7747 34.9604 12.0896 5.2591 13.1888 22.3322 11.7470 0.1683 0.6614 21.9479 4.4264 5.9279 24.3281 18.5903 17.7710 19.3392 17.9552 4.2136 34.8587 8.5540
temp: 298.150 k
press: 1.00000 atm
elementType: 8 8 7 6 6 6 6 6 6 6 6 6 6 6 6 6 6 6 6 6 6 6 6 6 6 1 1 1 1 1 1 1 1 1 1 1 1 1 1 1 1 1 1 1
symmnumber: 1
zpe: 915287.0 jmol-1
zpe.correction: 0.348614 hartree
zpe.thermalcorrener: 0.370138 hartree
zpe.thermalcorrenthalpy: 0.371082 hartree
zpe.thermalcorrgfe: 0.292711 hartree
zpe.sumelectzpe: -1053.191636 hartree
zpe.sumelectthermal: -1053.170112 hartree
zpe.sumelectthermalent: -1053.169168 hartree
zpe.sumelectthermalfe: -1053.247539 hartree
dipole: 0.6464 -2.5892 0.2419
dipole: 2.6797
quadrupole: -118.6803 -162.0042 -141.4119
quadrupole: 10.1893 -11.2284 5.7550
quadrupole: 22.0185 -21.3054 -0.7131 10.1893 -11.2284 5.7550
hfenergy: -1053.5402499 hartree
pointgroup: C01 [X(C22H19N1O2)]
dipole: 0.4384316 0.9517705 0.1156289 debye
polarizability: 257.9488496|-10.9820279|252.4508065|26.0190557|-13.3162473|216.4453297 unknown
InChI: InChI=1S/C22H19NO2/c24-21(18-7-3-1-4-8-18)15-20(17-11-13-23-14-12-17)16-22(25)19-9-5-2-6-10-19/h1-14,20H,15-16H2
charge 0 multiplicity 1
44 atoms
O  -1.180374 0.12128 1.614219
O  2.083832 1.832195 -1.90258
N  -1.641544 -4.594737 -0.960104
C  0.333133 -0.67298 -0.634082
C  -0.698882 0.481671 -0.750373
C  1.471057 -0.50095 -1.698183
C  -0.345023 -2.038851 -0.759749
C  -1.500005 0.709663 0.537364
C  2.349968 0.706876 -1.375001
C  -0.6274 -2.817314 0.390774
C  -0.737275 -2.575204 -2.014155
C  -2.658427 1.664681 0.504644
C  3.482606 0.568074 -0.398992
C  -1.264663 -4.070435 0.244946
C  -1.373295 -3.835286 -2.064947
C  -2.988885 2.42647 -0.649277
C  3.800019 -0.661262 0.241559
C  -3.443075 1.813454 1.68111
C  4.258411 1.722973 -0.10101
C  -4.082345 3.318039 -0.62457
C  4.869036 -0.731246 1.160016
C  -4.537319 2.699334 1.703143
C  5.326473 1.651537 0.812986
C  -4.859941 3.454681 0.549132
C  5.634689 0.422743 1.447103
H  0.775469 -0.614483 0.377934
H  -1.392444 0.288716 -1.591386
H  -0.17463 1.427457 -1.001086
H  2.06381 -1.430936 -1.747695
H  1.02901 -0.324068 -2.694731
H  -0.372993 -2.437627 1.385211
H  -0.552033 -2.031628 -2.947625
H  -1.489909 -4.687253 1.122467
H  -1.683429 -4.266408 -3.024035
H  -2.39279 2.336691 -1.563281
H  3.21865 -1.564978 0.030805
H  -3.169437 1.221523 2.560828
H  3.997249 2.66116 -0.601841
H  -4.328493 3.905521 -1.515667
H  5.105722 -1.681261 1.650959
H  -5.138917 2.804976 2.612408
H  5.918877 2.545763 1.034956
H  -5.710624 4.145207 0.565051
H  6.46524 0.365725 2.159561
