program: Gaussian 09
title: 000219447
version: EM64L-G09RevD.01
frameworkgroup: C1[X(C22H19NO2)]
method: RPBEPBE
basis: SDD
operation: Freq
keyword: #p
keyword: freq=noraman
keyword: PBEPBE/SDD
title: #p freq=noraman PBEPBE/SDD
converged: YES YES NO NO
title: Mulliken charges:
elementType: O O N C C C C C C C C C C C C C C C C C C C C C C H H H H H H H H H H H H H H H H H H H
charge: -0.221863 -0.221805 -0.069314 -0.141928 -0.614724 -0.614742 0.217967 0.140211 0.140249 -0.313031 0.291167 0.291099 -0.193809 -0.378994 -0.338421 -0.338441 -0.352164 -0.352154 -0.186192 -0.250950 -0.250947 -0.231727 -0.231735 -0.224829 -0.224827 0.272720 0.269044 0.234523 0.269082 0.234497 0.254283 0.235693 0.233005 0.247663 0.247709 0.277709 0.277709 0.226898 0.229874 0.229872 0.232907 0.232907 0.232905 0.232904
chargesum: 0.00000
title: Mulliken charges with hydrogens summed into heavy atoms:
elementType: O O N C C C C C C C C C C C C C C C C C C C C C C
charge: -0.221863 -0.221805 -0.069314 0.130792 -0.111157 -0.111163 0.217967 0.140211 0.140249 -0.058748 0.291167 0.291099 0.041884 -0.145989 -0.090758 -0.090733 -0.074455 -0.074445 0.040706 -0.021075 -0.021075 0.001180 0.001172 0.008076 0.008077
polarizability: 3.03437784e+02 -3.68077546e-02 2.24410396e+02 -2.34203750e-02 -4.20217100e+01 1.96859977e+02
1716.lowfreq: -6.2540 -3.8755 0.0001 0.0006 0.0007 4.3736 16.3229 19.1330 25.8025
frequency: 16.2922 19.0954 25.7915 27.1905 28.9126 44.1901 57.2401 69.9588 117.3272 135.0482 147.8460 150.6540 165.2928 205.3686 226.3331 230.8165 300.3395 315.2426 385.5558 399.5198 399.5289 403.1744 413.0203 413.4529 432.0796 469.5419 504.3945 546.7279 547.4580 572.4766 613.2905 613.8002 614.1062 622.4188 647.8198 661.6371 695.7957 696.1420 748.9779 755.3445 763.4971 767.0458 781.2607 798.0919 803.6119 858.3110 858.7301 897.6093 906.2976 937.7422 950.5358 956.6230 959.5144 975.2097 984.6805 990.0372 990.0421 990.6644 990.7053 997.2350 1000.8478 1010.5902 1011.9833 1024.9836 1027.2966 1039.3914 1074.1893 1076.2793 1085.4797 1087.9597 1091.2589 1160.7328 1165.3132 1172.6808 1172.8473 1177.9404 1185.6809 1188.6121 1206.5429 1206.6769 1233.1142 1262.0183 1292.8429 1308.5943 1311.8794 1313.3644 1337.0331 1337.6955 1362.4156 1387.2759 1387.3750 1418.3671 1421.8229 1430.4637 1436.1929 1436.8403 1456.8296 1478.6093 1478.8688 1565.2915 1569.1061 1570.4619 1585.4110 1597.8676 1599.1467 1612.4813 1613.2194 2959.7089 2962.8668 3019.8930 3020.0201 3060.1330 3121.5928 3127.9790 3127.9928 3138.2763 3138.3031 3139.9041 3150.0536 3150.1047 3159.0808 3159.1197 3163.1625 3169.0961 3169.1661 3182.1423
redmass: 5.2931 5.3817 4.6659 4.6015 4.2061 4.6814 6.8932 7.5109 5.3077 4.2172 7.5936 5.1637 3.5945 4.3670 3.1937 2.8822 6.3429 5.8414 4.3560 2.8056 2.8074 3.6448 3.2095 3.2267 6.6423 5.3808 4.4843 2.3251 2.7379 2.9640 6.0445 6.4197 5.6756 5.2863 6.8169 5.0878 1.8194 1.8086 1.6524 2.5726 2.2270 2.8291 2.4858 2.4959 4.8063 1.2538 1.2504 1.4650 1.7031 1.4978 1.5237 1.5075 4.0917 4.1973 4.8547 5.8414 5.9227 1.4012 1.3959 2.6103 1.3571 1.3427 1.4292 2.2165 1.9936 2.4121 2.0336 2.7957 1.6502 1.7555 1.7674 1.2272 1.0757 1.0768 1.0717 1.2399 1.1445 1.1397 1.7291 1.9997 2.4848 1.7911 1.6860 4.8526 1.4223 1.3843 1.7757 1.6840 1.5229 9.4035 9.4175 1.1045 1.8946 1.2512 2.2252 2.0225 2.1441 2.2199 2.2153 5.9586 6.9425 6.8425 5.7767 6.7946 6.8730 6.4553 6.6163 1.0619 1.0611 1.0947 1.0967 1.0857 1.0882 1.0850 1.0850 1.0881 1.0881 1.0899 1.0924 1.0924 1.0959 1.0959 1.0976 1.1012 1.1012 1.0978
irintensity: 0.3557 1.5081 0.9372 0.0610 3.6182 0.5697 0.4703 8.7940 0.0624 0.1475 0.8108 0.5002 0.2642 4.4980 1.9304 4.1239 20.5235 1.9269 3.2089 0.0363 0.0619 11.7612 0.0472 1.9474 0.3828 10.7200 5.5980 2.6272 54.8339 13.0057 1.4450 1.5378 3.0123 4.5328 4.5148 0.3602 0.6595 95.3268 39.8876 83.9936 10.5680 0.3351 46.2879 7.3717 1.0737 0.0180 0.9137 0.0244 0.1750 11.3005 0.2604 1.1586 2.6114 5.2747 95.0503 11.0644 6.6580 0.8849 0.8422 6.3957 1.4600 0.3589 0.2474 2.1441 0.3992 3.2970 5.9009 3.9803 14.2922 0.2817 5.3878 0.3612 1.8187 3.9240 10.1899 21.7110 76.5655 1.2662 70.0259 14.0539 18.6400 321.3580 9.4266 0.2006 1.1881 0.1610 3.3322 95.9603 2.7884 0.7535 4.8545 0.2093 26.0896 17.2505 38.9297 15.7913 43.6314 1.3452 0.4919 9.7392 39.2632 122.2041 40.5294 14.0925 62.1701 9.4090 11.1614 32.7053 52.4628 3.6761 10.5049 5.9046 14.4954 0.2561 0.0918 3.5595 10.6368 15.1398 31.1615 7.3430 16.1620 26.7886 37.2017 34.6409 10.4242 2.9316
temp: 298.150 k
press: 1.00000 atm
elementType: 8 8 7 6 6 6 6 6 6 6 6 6 6 6 6 6 6 6 6 6 6 6 6 6 6 1 1 1 1 1 1 1 1 1 1 1 1 1 1 1 1 1 1 1
symmnumber: 1
zpe: 913271.8 jmol-1
zpe.correction: 0.347847 hartree
zpe.thermalcorrener: 0.369513 hartree
zpe.thermalcorrenthalpy: 0.370457 hartree
zpe.thermalcorrgfe: 0.292117 hartree
zpe.sumelectzpe: -1053.197233 hartree
zpe.sumelectthermal: -1053.175567 hartree
zpe.sumelectthermalent: -1053.174623 hartree
zpe.sumelectthermalfe: -1053.252963 hartree
dipole: -0.0014 -2.4641 2.9424
dipole: 3.8379
quadrupole: -116.2849 -129.9028 -147.6313
quadrupole: -0.0174 -0.0108 -4.1402
quadrupole: 14.9881 1.3702 -16.3583 -0.0174 -0.0108 -4.1402
hfenergy: -1053.54508 hartree
pointgroup: C01 [X(C22H19N1O2)]
dipole: 0.0022564 -1.113767 -1.019511 debye
polarizability: 303.4353731|0.3607683|234.9292195|-0.421261|36.9507391|186.3435648 unknown
InChI: InChI=1S/C22H19NO2/c24-21(17-9-3-1-4-10-17)15-19(20-13-7-8-14-23-20)16-22(25)18-11-5-2-6-12-18/h1-14,19H,15-16H2
charge 0 multiplicity 1
44 atoms
O  2.49502 0.861764 1.557935
O  -2.497885 0.847359 1.565346
N  -0.00947 1.33873 -1.684281
C  -0.001088 0.139217 0.458739
C  1.269176 -0.674517 0.113194
C  -1.267273 -0.683014 0.118388
C  -0.006901 1.456624 -0.318487
C  2.546481 -0.098295 0.73317
C  -2.545997 -0.114656 0.742667
C  -0.009303 2.715409 0.327401
C  3.869734 -0.711522 0.361544
C  -3.866396 -0.738031 0.377857
C  -0.014473 3.888654 -0.457349
C  -0.014488 2.478955 -2.432703
C  3.981807 -1.795704 -0.550509
C  -3.974535 -1.825004 -0.531343
C  5.048946 -0.182836 0.954382
C  -5.046845 -0.216498 0.974555
C  -0.017136 3.773742 -1.867164
C  5.246801 -2.338924 -0.861406
C  -5.236884 -2.378083 -0.83553
C  6.311286 -0.72404 0.643129
C  -6.306557 -0.767528 0.669979
C  6.413733 -1.804952 -0.266572
C  -6.405079 -1.851232 -0.236828
H  0.000274 0.37836 1.535651
H  1.374314 -0.724386 -0.98876
H  1.166962 -1.721649 0.469176
H  -1.376286 -0.734244 -0.983144
H  -1.156764 -1.729213 0.474601
H  -0.007119 2.759272 1.419086
H  -0.0164 4.87416 0.020704
H  -0.016406 2.339744 -3.520459
H  3.087696 -2.216753 -1.021426
H  -3.079425 -2.240613 -1.005194
H  4.941629 0.65263 1.654282
H  -4.942561 0.621283 1.672142
H  -0.021142 4.658551 -2.51182
H  5.324979 -3.173997 -1.566178
H  -5.312053 -3.215296 -1.538087
H  7.214306 -0.309123 1.104122
H  -7.21057 -0.358105 1.133927
H  7.39536 -2.226795 -0.510202
H  -7.384662 -2.280742 -0.475232
