program: Gaussian 09
title: 000219438
version: EM64L-G09RevD.01
frameworkgroup: C1[X(C8H16N2OS2)]
method: RPBEPBE
basis: SDD
operation: Freq
keyword: #p
keyword: freq=noraman
keyword: PBEPBE/SDD
title: #p freq=noraman PBEPBE/SDD
converged: YES YES NO NO
title: Mulliken charges:
elementType: S S O N N C C C C C C C C H H H H H H H H H H H H H H H H
charge: 0.194147 -0.049195 -0.258315 0.012096 -0.603814 -0.360544 -0.377099 -0.435521 -0.640957 -0.639300 -0.668337 -0.440046 0.195638 0.258605 0.215750 0.250160 0.229630 0.207546 0.253988 0.222333 0.215520 0.247146 0.223593 0.297505 0.277748 0.255225 0.249063 0.327612 0.339824
chargesum: 0.00000
title: Mulliken charges with hydrogens summed into heavy atoms:
elementType: S S O N N C C C C C C C C
charge: 0.194147 -0.049195 -0.258315 0.012096 0.063622 0.113812 0.102691 -0.435521 0.042911 0.046958 -0.093084 0.064241 0.195638
polarizability: 1.95587732e+02 -1.32378489e+00 1.46694070e+02 5.79261239e+00 5.95108109e+00 8.91339126e+01
1716.lowfreq: -7.2393 -0.0030 -0.0014 -0.0013 2.7079 7.9471 30.8958 48.5647 58.9904
frequency: 30.8576 48.5537 58.9766 69.3481 86.4629 88.5129 107.7258 135.6268 171.2997 197.7703 207.7553 224.8497 257.5325 295.8573 313.6318 358.9623 367.0141 413.2252 420.6678 473.2431 520.2704 538.3935 564.8081 579.0767 625.5399 660.2603 703.6408 761.4913 766.9864 783.4709 815.6661 870.3578 901.4717 957.7464 972.3384 1008.6564 1031.2160 1068.6751 1076.9714 1084.9133 1095.3186 1145.0773 1161.3857 1195.4209 1249.1072 1266.9339 1269.9297 1293.1348 1313.1707 1336.4901 1339.6005 1352.5824 1385.2590 1390.8247 1422.2985 1426.3134 1454.9754 1463.0141 1466.1875 1469.4026 1481.4653 1484.1848 1503.2971 1598.0162 1648.9612 2988.0878 2991.0990 3005.3215 3009.3434 3019.1015 3029.8686 3061.1407 3069.7553 3087.0162 3087.9141 3095.6469 3103.4667 3104.4710 3117.0460 3441.6372 3634.4886
redmass: 6.5268 4.7685 4.4882 5.7739 2.9787 2.8873 3.9413 3.4717 3.5492 1.6434 1.0691 2.2041 2.3446 4.0605 3.6854 4.8056 3.8401 2.9675 3.0793 4.0811 3.0136 3.3813 1.4973 5.0250 1.6418 1.6493 2.1522 1.8333 1.6938 1.1589 1.7259 3.8617 3.2180 2.4542 1.8591 2.7942 4.3370 2.2440 1.8717 1.6690 1.8660 1.8236 1.2300 2.6507 1.2016 1.3498 1.1670 1.2284 1.2930 3.3676 1.2624 1.2771 1.2095 1.2044 1.2547 1.5213 1.0856 1.1124 1.0542 1.0648 1.0609 1.0738 1.2576 1.3110 4.6441 1.0358 1.0358 1.0613 1.0610 1.0623 1.0580 1.1025 1.1008 1.1000 1.0997 1.1023 1.1017 1.1016 1.1048 1.0509 1.0996
irintensity: 0.3621 4.0013 4.9305 4.2550 4.9238 0.1352 0.8135 0.5555 3.4955 1.1415 0.3963 0.7383 3.7909 2.5397 0.4497 7.5544 10.5186 1.1769 22.7967 3.2307 7.7543 3.0224 95.7548 4.4964 178.4586 4.8295 13.1828 12.3773 9.1390 1.7106 39.3260 9.4679 47.2381 29.0307 1.1727 10.5847 5.6687 16.6156 19.7216 8.9393 13.2229 36.6272 2.7689 57.4222 5.0433 88.5846 9.1237 17.1219 29.8111 100.9579 13.3380 20.9944 14.5058 25.6289 78.2383 75.4391 16.6890 26.4653 20.3623 2.8124 7.1579 25.7804 86.9567 125.2065 334.3872 28.9960 24.4717 31.5883 33.3130 3.4136 19.5457 5.6980 3.3675 29.8434 34.3647 2.6901 5.0407 46.4182 6.2157 130.5141 92.8066
temp: 298.150 k
press: 1.00000 atm
elementType: 16 16 8 7 7 6 6 6 6 6 6 6 6 1 1 1 1 1 1 1 1 1 1 1 1 1 1 1 1
symmnumber: 1
zpe: 626111.0 jmol-1
zpe.correction: 0.238473 hartree
zpe.thermalcorrener: 0.254686 hartree
zpe.thermalcorrenthalpy: 0.255631 hartree
zpe.thermalcorrgfe: 0.193391 hartree
zpe.sumelectzpe: -1294.280924 hartree
zpe.sumelectthermal: -1294.264711 hartree
zpe.sumelectthermalent: -1294.263766 hartree
zpe.sumelectthermalfe: -1294.326006 hartree
dipole: 7.1101 0.1958 -0.1402
dipole: 7.1142
quadrupole: -105.6004 -90.8926 -95.1101
quadrupole: -10.2599 4.3958 0.8765
quadrupole: -8.3994 6.3085 2.0909 -10.2599 4.3958 0.8765
hfenergy: -1294.5193971 hartree
pointgroup: C01 [X(C8H16N2O1S2)]
dipole: 2.765458 -0.0278354 0.4307304 debye
polarizability: 194.9844615|1.1944221|136.5290746|8.4494439|23.1818529|99.9021789 unknown
InChI: InChI=1S/C8H16N2OS2/c1-3-10(4-2)8(12)13-6-5-7(9)11/h3-6,9H2,1-2H3
charge 0 multiplicity 1
29 atoms
S  -0.414974 1.244241 1.385616
S  -0.070226 -1.343043 -0.385575
O  -5.166622 0.574199 -0.605874
N  1.950891 0.256538 0.505504
N  -3.646459 -1.160459 -0.948189
C  2.919135 -0.606229 -0.23022
C  2.553145 1.381387 1.276209
C  0.607904 -0.000189 0.454068
C  3.404644 -1.797935 0.619242
C  2.703725 2.667937 0.43698
C  -2.153086 0.563218 1.108479
C  -2.757257 1.006651 -0.241597
C  -3.976601 0.1418 -0.613519
H  2.421068 -0.972256 -1.143819
H  3.767632 0.038234 -0.526522
H  1.938749 1.573519 2.173273
H  3.540824 1.034342 1.631138
H  3.887821 -1.460767 1.554384
H  2.555049 -2.452834 0.875189
H  4.141349 -2.39119 0.047841
H  3.331715 2.49293 -0.454991
H  1.718819 3.035927 0.103903
H  3.182822 3.458419 1.042582
H  -2.056344 -0.532922 1.175725
H  -2.734517 0.937279 1.967518
H  -1.992114 0.904671 -1.032079
H  -3.084667 2.057301 -0.19707
H  -4.39027 -1.810328 -1.200545
H  -2.668752 -1.468643 -0.945452
