program: Gaussian 09
title: 000219435
version: EM64L-G09RevD.01
frameworkgroup: C1[X(C10H11Cl2NO2)]
method: RPBEPBE
basis: SDD
operation: Freq
keyword: #p
keyword: freq=noraman
keyword: PBEPBE/SDD
title: #p freq=noraman PBEPBE/SDD
converged: YES YES NO NO
title: Mulliken charges:
elementType: Cl Cl O O N C C C C C C C C C C H H H H H H H H H H H
charge: 0.024487 0.046247 -0.387585 -0.272788 -0.354551 -0.648815 0.409039 -0.049231 0.235871 -0.585711 -0.387606 -0.384293 -0.219085 -0.217411 -0.234617 0.253555 0.256339 0.281665 0.359092 0.333707 0.241285 0.238145 0.232559 0.231072 0.233718 0.364912
chargesum: 0.00000
title: Mulliken charges with hydrogens summed into heavy atoms:
elementType: Cl Cl O O N C C C C C C C C C C
charge: 0.024487 0.046247 -0.022672 -0.272788 0.004541 -0.138921 0.409039 0.232434 0.235871 -0.252004 -0.146321 -0.146148 0.013474 0.013662 -0.000900
polarizability: 1.43178260e+02 -2.29955944e+01 1.46271794e+02 2.28393289e+00 -3.73522756e+00 1.14547493e+02
1716.lowfreq: -8.2119 -4.4240 -0.0021 -0.0008 0.0022 3.9704 8.3831 21.4743 35.1846
frequency: 5.1100 21.3666 35.1748 35.8168 58.5529 79.6283 146.2023 188.2988 199.3380 213.0137 271.7846 276.2775 312.0257 318.4361 376.9385 402.7818 441.4128 497.3798 548.0978 572.6356 600.3209 617.0308 641.6273 681.0587 698.4701 706.3038 721.2536 763.0439 830.4554 857.4040 896.3368 916.4312 927.3022 966.8609 979.9679 989.8736 998.7505 1023.6498 1027.5131 1082.1995 1095.2268 1172.9370 1177.5138 1182.8734 1189.5787 1201.8782 1206.6198 1219.2859 1264.0970 1288.3769 1324.1106 1327.6733 1380.7687 1391.6704 1439.9194 1442.8696 1462.6219 1484.6581 1591.6437 1605.0183 1615.4643 3006.0963 3010.9238 3061.8816 3120.3981 3121.4904 3136.7958 3137.6346 3149.8132 3167.4960 3498.2022 3580.1584
redmass: 6.1173 4.0904 8.8633 7.9018 6.4110 6.5546 6.8868 6.9724 10.9396 9.2097 2.4866 1.7265 3.7704 2.6043 6.6147 2.8187 4.1778 3.6255 6.2250 4.1352 5.4361 6.3613 3.4661 2.8775 1.6984 1.7435 6.9464 1.9982 3.7970 1.2491 4.2136 2.0434 1.5090 3.5367 1.3886 6.2908 1.3166 4.2160 2.2548 1.5981 4.6246 1.1122 1.1073 1.0659 1.1218 1.7583 1.2256 2.2881 1.2152 1.5742 1.5215 1.2721 8.1758 1.3668 2.0256 1.2154 1.6880 2.3248 6.0131 7.5375 6.4044 1.0615 1.0837 1.0990 1.0881 1.0874 1.0890 1.0906 1.0958 1.1015 1.0777 1.0667
irintensity: 0.0190 1.3109 4.6423 7.0704 0.5679 0.0658 1.7976 0.8239 0.4556 3.1330 73.0927 75.4922 4.7670 5.1314 10.3389 0.1701 4.4637 59.9569 36.1960 11.9225 18.7615 0.0465 2.4187 73.9437 69.0094 48.2357 99.1677 44.9080 4.1477 0.2273 27.3591 2.4830 8.1831 6.8675 0.1316 0.4460 0.6216 161.1797 12.9636 9.3573 23.1110 1.9192 2.0357 7.3193 0.1748 31.5471 27.5396 14.6888 35.2389 20.0218 68.5444 0.2029 0.1068 4.1447 20.2990 118.9118 250.8727 18.5710 1.9345 244.8382 26.1168 11.4565 18.2166 2.8551 5.6268 6.4211 2.9332 6.7295 32.7512 17.9123 55.5963 20.1097
temp: 298.150 k
press: 1.00000 atm
elementType: 17 17 8 8 7 6 6 6 6 6 6 6 6 6 6 1 1 1 1 1 1 1 1 1 1 1
symmnumber: 1
zpe: 508304.2 jmol-1
zpe.correction: 0.193603 hartree
zpe.thermalcorrener: 0.208897 hartree
zpe.thermalcorrenthalpy: 0.209841 hartree
zpe.thermalcorrgfe: 0.145648 hartree
zpe.sumelectzpe: -1511.873872 hartree
zpe.sumelectthermal: -1511.858577 hartree
zpe.sumelectthermalent: -1511.857633 hartree
zpe.sumelectthermalfe: -1511.921827 hartree
dipole: 3.5598 -0.3433 -0.2314
dipole: 3.5838
quadrupole: -105.2713 -109.4968 -93.8374
quadrupole: -6.8563 1.8981 5.9721
quadrupole: -2.4027 -6.6283 9.0311 -6.8563 1.8981 5.9721
hfenergy: -1512.0674743 hartree
pointgroup: C01 [X(C10H11Cl2N1O2)]
dipole: -1.4016024 -0.0104733 -0.153084 debye
dipolederiv: -0.3565176 -0.1970999 -0.032787 -0.2244526 -0.493181 0.0700279 -0.0626302 0.0554256 -0.1584836 -0.7542171 -0.0076526 -0.1959891 0.0468938 -0.1631997 0.0462363 -0.1962511 0.0454502 -0.1737541 -0.7714265 0.133708 0.0424366 0.2150414 -0.2704808 -0.241076 0.2174488 -0.2402095 -0.61921 -0.8084482 -0.4165455 0.0612853 -0.0407977 -1.0216676 0.2001672 -0.051071 0.1316887 -0.396319 -1.1355886 0.4615083 -0.1022843 0.4622255 -0.9275019 0.2140574 -0.3499128 0.3546313 -0.6318287 -0.3657118 -0.0640657 -0.0486058 0.0834936 0.0454172 0.0316287 -0.1194112 0.0060995 0.1042294 0.0301285 0.1357026 -0.0509581 0.2709361 0.1093141 -0.0117677 -0.1028497 -0.0347835 -0.0156542 1.0076699 -0.4812901 -0.0542091 -0.2770263 0.1432558 0.2402779 -0.0950097 0.0439251 0.7353521 1.2359044 0.1559174 0.110073 -0.3840484 1.5521204 -0.4556107 0.2670903 -0.3603208 0.2808225 1.1470212 0.2703724 0.2404162 0.2503414 0.7476797 -0.0860572 0.2918575 -0.1272804 0.3013282 -0.1822489 0.0036117 -0.071869 -0.0181269 -0.1337534 0.004098 -0.070861 0.0021451 0.0482602 -0.1779027 0.009172 0.0023607 -0.0169398 -0.0386487 0.0999273 0.0115563 0.1157294 -0.0196105 -0.0946829 0.0454406 -0.0094737 0.0735849 0.0461589 0.1050258 -0.0017239 0.1064393 0.0251137 -0.0699578 0.0381617 -0.0898972 0.0385358 -0.0590283 -0.0034263 -0.1061868 -0.0054509 0.1021273 -0.0985693 0.105628 -0.0471603 0.0929492 0.0312422 -0.0278626 -0.03915 -0.0309446 -0.0758099 0.0468118 -0.022958 0.0014614 -0.0599651 0.0680297 0.0006071 -0.0020166 0.0717531 -0.0581746 0.0333101 0.0156009 0.0203666 -0.0242555 -0.0293288 -0.0354382 0.0585459 -0.0917383 0.0593253 0.0603695 0.0047667 -0.000845 -0.1095316 0.0379561 -0.1026197 0.0417556 0.0256353 0.0139102 0.3440518 0.0552951 -0.0161751 -0.0744713 0.1331815 -0.0022063 0.0747013 -0.0189072 0.2780304 -0.0401721 0.0027247 0.0306865 0.0003073 -0.0362206 -0.0368659 0.0073095 -0.0094751 0.0174721 0.1049492 -0.0275031 0.0972323 -0.0273611 0.0866098 0.0298832 0.0960535 0.0118716 -0.0570363 0.136476 -0.0533339 -0.01123 -0.0422833 -0.0206172 -0.1048205 -0.0087731 -0.0858439 0.0194848 0.1278148 -0.0413553 0.0034256 -0.0637159 -0.0113114 -0.1056271 -0.0056698 -0.1082596 0.0056548 0.0951275 -0.031677 0.0887214 -0.0389218 0.0952339 0.0005194 0.1088582 0.0081174 -0.0728682 0.0770927 -0.1100679 0.0456244 -0.1256698 -0.0315924 0.0294124 0.0511464 0.0320221 0.0843326 0.408716 0.0159389 -0.0126062 -0.0067417 0.1403325 0.1415097 -0.0148063 0.1022801 0.2033057 unknown
polarizability: 147.8320406|22.9898706|140.3231663|-3.0609421|-6.0147013|115.8423398 unknown
InChI: InChI=1S/C10H11Cl2NO2/c11-9(12)10(15)13-8(14)6-7-4-2-1-3-5-7/h1-5,9-10,13,15H,6H2
charge 0 multiplicity 1
26 atoms
Cl 1.763229 -2.08133 1.338954
Cl 4.414028 -0.578299 1.689872
O  2.973183 -0.503582 -1.071074
O  1.24429 2.782601 -0.814509
N  0.956389 0.54884 -0.224366
C  -1.036483 1.884852 -0.911307
C  -1.874496 0.672091 -0.544087
C  2.38336 0.310864 -0.020592
C  0.480168 1.786016 -0.644483
C  2.604714 -0.40638 1.317291
C  -2.07603 -0.380651 -1.475609
C  -2.45403 0.55582 0.746714
C  -2.834146 -1.521297 -1.126152
C  -3.213732 -0.582217 1.098934
C  -3.404743 -1.625715 0.163382
H  -1.134529 2.123698 -1.98727
H  -1.375183 2.786382 -0.369311
H  2.858363 1.311409 0.035063
H  0.316062 -0.249656 -0.160854
H  2.161829 0.157616 2.147332
H  -1.644337 -0.302641 -2.481304
H  -2.312549 1.363209 1.475844
H  -2.981365 -2.323239 -1.85791
H  -3.656852 -0.654262 2.09835
H  -3.993955 -2.508315 0.435138
H  3.132712 0.065084 -1.865644
