program: Gaussian 09
title: 000219433
version: EM64L-G09RevD.01
frameworkgroup: C1[X(C5H5N5O)]
method: RPBEPBE
basis: SDD
operation: Freq
keyword: #pfreq=noraman
keyword: PBEPBE/SDD
title: #p freq=noraman PBEPBE/SDD
converged: NO YES NO NO
title: Mulliken charges:
elementType: O N N N N N C C C C C H H H H H
charge: -0.254647 -0.339351 -0.255842 -0.123991 -0.064898 -0.581205 0.053206 0.157114 -0.253268 0.000126 0.029866 0.295865 0.337743 0.335204 0.326841 0.337237
chargesum: 0.00000
title: Mulliken charges with hydrogens summed into heavy atoms:
elementType: O N N N N N C C C C C
charge: -0.254647 -0.001608 0.079363 -0.123991 -0.064898 0.082873 0.053206 0.157114 0.042598 0.000126 0.029866
polarizability: 1.45652546e+02 -6.00046004e+00 1.07083979e+02 -1.10421703e-01 2.94382330e-01 3.77275547e+01
1716.lowfreq: -0.0004 0.0006 0.0009 2.7609 4.9043 9.1248 108.4188 178.1710 211.7806
frequency: 108.4172 178.1701 211.7800 285.8708 296.5240 328.2666 382.9985 466.1202 471.7767 486.0725 509.3849 531.6694 570.9437 599.5755 636.5354 666.5885 717.4349 780.3766 786.7085 864.9904 894.6455 962.5676 991.8752 1033.6545 1120.6320 1178.4113 1211.5015 1271.7852 1333.1651 1362.2311 1372.7606 1438.0860 1479.2048 1548.7142 1572.6349 1602.9411 1630.5349 3239.3841 3552.3045 3566.4559 3577.6482 3715.4372
redmass: 5.6659 6.8832 6.7437 6.2071 7.1528 3.3963 1.2501 2.2030 2.1291 1.2090 4.9857 3.4528 1.0833 6.7926 6.3354 9.3425 9.4792 5.8188 7.4594 1.5409 5.0479 7.9155 2.4347 2.1635 2.7040 3.6345 1.5887 4.4653 1.6785 5.9071 6.1360 1.8272 3.5385 3.8414 5.8597 2.2041 5.6684 1.1003 1.0440 1.0814 1.0822 1.1060
irintensity: 13.8425 6.2721 1.4942 5.8339 24.8796 5.2924 277.3207 72.8203 53.9990 453.0109 14.2909 1.3330 28.8102 3.1398 2.7784 4.8378 6.2740 33.1577 8.9113 27.9571 2.4629 5.5001 32.1374 84.9258 8.3982 40.6201 6.0963 2.0000 0.2176 128.4136 190.4907 41.3028 324.3702 8.2676 320.1319 761.3262 205.8169 3.5963 142.9744 63.9067 113.9213 47.6571
temp: 298.150 k
press: 1.00000 atm
elementType: 8 7 7 7 7 7 6 6 6 6 6 1 1 1 1 1
symmnumber: 1
zpe: 296295.7 jmol-1
zpe.correction: 0.112853 hartree
zpe.thermalcorrener: 0.121496 hartree
zpe.thermalcorrenthalpy: 0.122440 hartree
zpe.thermalcorrgfe: 0.079478 hartree
zpe.sumelectzpe: -541.706592 hartree
zpe.sumelectthermal: -541.697949 hartree
zpe.sumelectthermalent: -541.697005 hartree
zpe.sumelectthermalfe: -541.739967 hartree
dipole: -5.8722 -6.9731 0.0215
dipole: 9.1164
quadrupole: -32.7008 -72.2892 -65.3122
quadrupole: -2.4214 -1.2359 0.9804
quadrupole: 24.0666 -15.5218 -8.5448 -2.4214 -1.2359 0.9804
hfenergy: -541.819445 hartree
pointgroup: C01 [X(C5H5N5O1)]
dipole: 2.4435999 -2.6247889 -0.0580935 debye
dipolederiv: -0.50602 -0.1137507 -0.0021985 -0.0321818 -1.3127869 -0.0062865 0.0083795 -0.009003 -0.3983645 -0.3002164 0.0477013 0.1424179 0.572083 -0.3952667 -0.1275807 0.373549 -0.260675 -0.3016787 -1.1399168 0.3435283 -0.1415777 0.4853782 -0.0016275 0.1400065 -0.6617651 0.209766 -0.2353357 -1.7293022 0.2060123 0.033593 0.0193513 -0.6142058 -0.0074481 0.0350457 0.0006594 -0.2636997 -0.83994 -0.5478248 -0.0023123 -0.3626797 -1.4303508 -0.0152279 -0.0018497 -0.0025293 -0.3060462 -1.4299784 -0.5979308 0.0023601 -0.530072 -0.5191238 0.0098279 0.0151502 0.0157405 -0.7016857 -0.8700312 0.1460977 -0.0193059 -0.4509655 -0.3930708 -0.0004935 0.0333561 -0.0009128 0.0211416 1.4625289 -0.0189935 -0.0787151 0.6913341 0.3314992 0.0459156 0.0050906 0.0064544 0.1416772 0.9442783 -0.1096253 0.0805736 -0.4745792 0.1712371 -0.0672756 0.139902 -0.0005115 -0.0273201 1.1670467 0.4145207 0.0033344 0.0669566 1.6883697 0.0093025 -0.031842 0.0010159 0.1953942 2.0762234 0.2731917 -0.0319064 0.0925004 1.5686552 0.023469 -0.0472641 0.0193855 0.1875998 0.0871709 -0.0274488 -0.0002205 -0.0243689 0.0997529 0.0021061 -0.0204 0.0022857 0.1926316 0.1890779 -0.0356832 -0.0283177 -0.0919483 0.2690848 0.0306852 -0.1335214 0.1080185 0.3688561 0.3690447 -0.0432022 0.0360089 -0.0260843 0.1836791 -0.0307175 0.2831906 -0.0817816 0.35272 0.2202257 0.0289448 0.0036162 0.1001866 0.2066756 -0.0038092 0.000273 -0.0042208 0.3845944 0.2998085 0.0344624 0.0026501 -0.0349106 0.1474789 -0.0024738 0.0027057 -0.0036919 0.3895155 unknown
polarizability: 144.9543341|7.8919391|107.7732204|-0.8203803|0.4673947|37.7365244 unknown
InChI: InChI=1S/C5H5N5O/c6-5-8-3-2(1-7-10-3)4(11)9-5/h1,7,10H,6H2
charge 0 multiplicity 1
16 atoms
O  -0.376081 2.699227 0.022803
N  1.778387 -1.48029 -0.095575
N  2.745403 -0.457918 0.043325
N  -0.657368 -1.52903 -0.036205
N  -1.703252 0.74497 0.014841
N  -2.967244 -1.210944 0.016706
C  0.718554 0.546585 -0.031243
C  0.513092 -0.889687 -0.060877
C  2.088641 0.766727 0.004238
C  -0.477656 1.432826 0.004671
C  -1.733295 -0.608817 -0.001216
H  2.645372 1.701433 0.00759
H  2.000926 -2.438543 0.176818
H  3.693471 -0.639363 -0.289692
H  -3.031133 -2.225301 0.003284
H  -3.793316 -0.618376 0.038534
