program: Gaussian 09
title: 000219408
version: EM64L-G09RevD.01
frameworkgroup: C1[X(C8H7N3S)]
method: RPBEPBE
basis: SDD
operation: Freq
keyword: #pfreq=noraman
keyword: PBEPBE/SDD
title: #p freq=noraman PBEPBE/SDD
converged: YES YES NO NO
title: Mulliken charges:
elementType: S N N N C C C C C C C C H H H H H H H
charge: 0.187273 -0.068191 -0.076760 -0.576578 0.506373 -0.317274 -0.358279 -0.365612 -0.218028 -0.227694 -0.236899 -0.126635 0.277796 0.228942 0.230899 0.228536 0.231576 0.336985 0.343570
chargesum: 0.00000
title: Mulliken charges with hydrogens summed into heavy atoms:
elementType: S N N N C C C C C C C C
charge: 0.187273 -0.068191 -0.076760 0.103978 0.506373 -0.317274 -0.080483 -0.136669 0.012871 0.000842 -0.005324 -0.126635
polarizability: 2.26270869e+02 -1.79202031e+00 1.22568522e+02 -1.83266023e-03 -1.97958085e-02 4.69367648e+01
1716.lowfreq: -7.2480 -1.9415 -0.0010 -0.0009 -0.0009 9.5549 41.8188 78.0460 122.6275
frequency: 41.7929 78.0408 122.6269 179.9583 276.3017 284.9524 319.7688 349.9452 399.2406 400.2445 454.8440 497.8641 548.4569 576.2882 584.3723 590.0694 614.3265 644.4441 694.4650 750.9397 773.9587 850.0046 912.8920 929.9286 953.7298 981.5573 987.2477 1001.6978 1026.8755 1080.2030 1096.6765 1173.8516 1191.4833 1219.5954 1276.8360 1320.4469 1380.7263 1432.0304 1451.0026 1506.0497 1517.4023 1582.4180 1611.1346 1617.6799 3123.7474 3133.4625 3146.2340 3161.0041 3172.0483 3558.0422 3711.5014
redmass: 5.4402 5.3890 5.3493 5.2791 6.6932 1.6427 4.5772 2.1651 2.8240 6.5796 1.4474 2.6248 6.5141 8.9004 9.1057 5.5547 6.4380 7.5236 1.8101 9.2310 1.7918 1.2560 7.7786 1.4349 3.0470 1.3755 6.2066 1.3298 2.1890 2.1692 2.5328 1.0541 1.1154 3.3051 3.7657 1.3420 6.8869 2.6296 2.8435 4.2384 4.1395 5.9705 5.4527 1.3504 1.0865 1.0876 1.0927 1.0964 1.1001 1.0456 1.1042
irintensity: 2.5747 4.7270 4.9454 2.5284 3.4894 32.4888 7.3266 44.9785 0.0113 0.1209 229.9324 17.2206 7.6007 7.1900 2.4917 32.1105 1.1815 34.9150 50.2714 12.7012 62.6377 0.0991 23.4064 5.8983 25.1942 0.2365 0.0650 0.7089 6.2229 25.6212 19.9176 0.0702 1.3134 44.4741 38.2630 4.8695 0.8447 7.9538 17.6281 4.3472 373.1082 3.5971 14.7808 338.1257 8.1127 2.0371 23.2428 18.7296 18.7219 180.9641 57.8165
temp: 298.150 k
press: 1.00000 atm
elementType: 16 7 7 7 6 6 6 6 6 6 6 6 1 1 1 1 1 1 1
symmnumber: 1
zpe: 360616.7 jmol-1
zpe.correction: 0.137352 hartree
zpe.thermalcorrener: 0.147656 hartree
zpe.thermalcorrenthalpy: 0.148600 hartree
zpe.thermalcorrgfe: 0.100749 hartree
zpe.sumelectzpe: -870.502070 hartree
zpe.sumelectthermal: -870.491766 hartree
zpe.sumelectthermalent: -870.490822 hartree
zpe.sumelectthermalfe: -870.538673 hartree
dipole: -1.4774 -3.2313 -0.0136
dipole: 3.5530
quadrupole: -46.8463 -76.8085 -82.1821
quadrupole: 7.8948 0.0071 -0.0678
quadrupole: 21.7660 -8.1962 -13.5698 7.8948 0.0071 -0.0678
hfenergy: -870.639422 hartree
pointgroup: C01 [X(C8H7N3S1)]
dipole: 0.5132548 -1.2954306 0.1117169 debye
dipolederiv: -0.4568963 0.0461513 0.0025586 0.0195788 -0.5515666 0.0555471 0.004071 0.0554037 0.0610618 0.5055437 0.2077693 -0.0274042 -0.0093295 -0.4924161 0.0317471 -0.0051561 0.0285001 -0.1540313 -1.0692511 -0.2106331 0.0307294 0.965747 -0.4677721 0.0109603 -0.077778 0.0255732 -0.2156952 -1.8140436 0.3151387 -0.0149735 0.5112937 -0.2696604 -0.0427602 -0.03825 -0.0392908 -0.6913461 0.2433538 0.0171499 -0.0037994 0.177917 -0.0768252 0.0095873 -0.0189148 0.0115592 0.056754 0.4413997 -0.2414691 0.0147459 -0.6882828 0.63667 -0.053001 0.0546944 -0.0580207 -0.0343536 -0.1686041 0.0911298 -0.0073097 0.0061217 0.0320668 -0.0134736 0.0003381 -0.0151327 -0.1269259 -0.0535006 -0.0711829 0.0038982 -0.0958001 -0.0213917 -0.0101361 0.0060981 -0.0109278 -0.1614 0.0305588 -0.1230737 0.0075451 -0.1289044 0.0837446 -0.0173815 0.0077471 -0.0175125 -0.1464941 -0.0670714 0.0943701 -0.0093104 0.2062971 0.0976213 -0.0241523 -0.0184929 -0.022516 -0.1484545 -0.002801 0.009459 -0.0035163 -0.047669 -0.0384386 -0.0098358 0.0016054 -0.0105255 -0.161634 1.8586735 -0.1258351 -0.0094519 -0.9070377 0.731184 -0.0452868 0.0637907 -0.0553527 0.1239296 0.0946522 -0.0786613 0.0076056 -0.0443874 0.0159969 0.0123816 0.004517 0.0131573 0.1565006 0.0256616 0.1097797 -0.0072277 0.1025393 -0.0050713 0.0119858 -0.0065005 0.0122983 0.1568564 -0.0005045 0.0919591 -0.0053507 0.1150318 -0.0579037 0.0162412 -0.0072557 0.0165164 0.1553259 0.0225592 -0.0733394 0.0082565 -0.1110397 -0.0739436 0.0213146 0.0115127 0.0208371 0.1569949 -0.1393411 -0.0077863 0.0053753 -0.0083388 0.0938266 0.0060498 0.0055139 0.0060907 0.1638045 0.2473058 -0.0615765 0.0072742 -0.1439343 0.1951 0.0202406 0.0175789 0.0182478 0.4063798 0.3023053 0.0106506 0.0003548 0.0801973 0.1687793 0.0199716 -0.0051192 0.0210948 0.4027271 unknown
polarizability: 226.1356865|-3.8941781|122.1045883|-2.1603536|-6.5126657|47.5358817 unknown
InChI: InChI=1S/C8H7N3S/c9-8-11-10-7(12-8)6-4-2-1-3-5-6/h1-5H,9H2
charge 0 multiplicity 1
19 atoms
S  1.690406 -1.440403 0.06969
N  1.294953 1.200623 -0.165584
N  2.681634 1.051647 -0.170542
N  4.374783 -0.625467 -0.03648
C  -0.864046 -0.017585 -0.024024
C  0.597342 0.075196 -0.054011
C  -1.635133 1.178304 -0.112565
C  -1.537015 -1.264303 0.091448
C  -3.041261 1.119036 -0.085673
C  -2.94636 -1.316374 0.117875
C  -3.705363 -0.126668 0.029526
C  3.061038 -0.23253 -0.057747
H  -1.109779 2.134142 -0.200972
H  -0.960551 -2.194772 0.16064
H  -3.622979 2.044855 -0.154281
H  -3.451517 -2.284221 0.207492
H  -4.799828 -0.168498 0.050227
H  4.649243 -1.59905 0.043519
H  5.087633 0.097867 -0.110038
