program: Gaussian 09
title: 000219406
version: EM64L-G09RevD.01
frameworkgroup: C1[X(C16H17NO2)]
method: RPBEPBE
basis: SDD
operation: Freq
keyword: #p
keyword: freq=noraman
keyword: PBEPBE/SDD
title: #p freq=noraman PBEPBE/SDD
converged: YES YES NO NO
title: Mulliken charges:
elementType: O O N C C C C C C C C C C C C C C C C H H H H H H H H H H H H H H H H H
charge: -0.268062 -0.447356 -0.081767 -0.586563 -0.523939 0.528808 0.089020 0.334644 -0.372553 -0.438524 -0.360937 -0.352252 0.316186 -0.380765 -0.350611 -0.252653 -0.238933 -0.236138 -0.538263 0.226983 0.234231 0.251557 0.221637 0.236211 0.227722 0.247752 0.237311 0.238158 0.297129 0.226706 0.228025 0.230706 0.219340 0.244407 0.219696 0.373087
chargesum: 0.00000
title: Mulliken charges with hydrogens summed into heavy atoms:
elementType: O O N C C C C C C C C C C C C C C C C
charge: -0.268062 -0.074270 -0.081767 -0.125348 -0.050746 0.528808 0.089020 0.334644 -0.136342 -0.210802 -0.113185 -0.114941 0.316186 -0.142607 -0.053482 -0.025948 -0.010907 -0.005432 0.145181
polarizability: 2.62345188e+02 2.89344341e+00 2.16685091e+02 2.46250447e+01 3.24843995e+00 9.71094390e+01
1716.lowfreq: -11.7975 -0.0009 -0.0005 0.0004 2.6834 8.4727 19.8866 24.6197 28.6255
frequency: 19.8448 24.4807 28.1939 48.0068 77.9588 89.3070 106.9204 167.8458 177.2897 215.3994 226.1105 241.3015 288.9443 307.8053 334.9523 361.7779 381.7437 400.5100 414.1509 421.1750 439.2314 462.9973 486.4802 512.3591 531.4212 607.8878 618.7834 633.6723 654.3623 696.5351 714.0238 717.4363 749.7813 780.2404 788.2404 811.3225 824.1128 842.3214 852.4543 879.1317 933.3413 935.1596 964.0385 982.4400 988.7284 989.0314 999.4961 1001.7355 1002.8478 1012.8607 1027.3614 1064.0504 1092.2582 1109.5517 1112.4353 1149.7432 1156.8266 1175.4037 1178.3704 1205.0450 1215.7759 1228.5628 1258.4644 1259.8062 1262.6280 1293.5562 1306.3662 1328.9448 1335.5850 1378.6672 1382.5662 1417.1442 1435.5888 1436.1423 1466.6573 1470.5354 1472.8999 1482.5817 1489.7089 1502.8309 1569.0944 1582.3013 1584.8401 1609.5011 1624.4974 2955.9955 2991.0783 3004.2799 3042.3034 3046.0956 3075.5421 3116.8507 3122.5694 3123.1520 3124.9452 3136.0253 3150.9453 3159.8645 3164.0861 3165.3442 3206.3426 3559.6122
redmass: 3.8604 4.4977 4.0167 4.7562 3.8913 4.4156 4.2732 4.5167 3.6724 2.7495 3.8957 1.3556 4.6021 4.3909 2.8338 4.1196 4.2467 2.7318 2.9189 3.0720 2.8558 1.5924 3.9469 3.4440 3.1823 4.2763 5.7453 6.6296 4.6077 1.6853 4.5450 3.8405 3.7367 1.2789 2.3604 1.5621 1.9249 2.2454 1.2508 5.6960 1.4422 1.4110 1.3582 1.3871 6.1795 7.2121 2.2421 1.4348 2.7530 2.8094 2.9231 2.1262 1.6792 1.3864 1.2632 1.2083 1.3010 1.0573 1.2282 1.1262 2.0835 4.4592 1.5276 2.2919 1.3749 1.2669 1.2920 1.3719 1.4077 7.1073 4.9232 3.3302 2.2984 1.1715 1.0506 1.2658 1.0732 1.4125 1.2719 2.4897 5.5176 5.9882 6.9711 5.9148 6.4744 1.0331 1.0608 1.0622 1.1038 1.0991 1.1007 1.0894 1.0936 1.0947 1.0849 1.0893 1.0940 1.0935 1.0996 1.0952 1.0941 1.0674
irintensity: 0.6742 0.0901 0.1144 0.2003 0.4781 0.6621 4.8714 3.1897 0.0204 3.2646 0.4926 0.1272 1.1512 2.0341 0.3037 1.8717 3.6342 3.8339 2.4477 27.3087 40.4542 61.5645 1.5339 28.7179 28.2436 12.3794 2.8425 0.4633 20.4013 65.5565 10.8118 8.7698 41.3015 3.4156 31.1867 22.6972 3.6404 40.6491 1.3107 136.3198 3.0596 4.0617 0.1875 0.8568 11.6820 19.1798 25.9877 10.0631 8.1952 10.3010 12.0830 16.3748 1.9265 11.0155 0.6426 10.2058 0.8373 1.0314 62.7009 3.5179 27.4945 165.6354 10.4491 23.4537 41.6140 33.2986 1.2291 2.0802 1.9933 0.9482 8.0978 2.8084 10.8301 9.1490 13.6798 12.4602 58.8720 13.8657 10.5862 136.1094 3.9829 0.7234 10.2742 0.2001 37.1108 69.9326 9.8318 35.0964 51.8841 3.8931 22.9479 24.7968 34.9612 5.0445 0.3803 10.3171 41.8278 15.9432 20.7222 5.0838 5.0395 53.0987
temp: 298.150 k
press: 1.00000 atm
elementType: 8 8 7 6 6 6 6 6 6 6 6 6 6 6 6 6 6 6 6 1 1 1 1 1 1 1 1 1 1 1 1 1 1 1 1 1
symmnumber: 1
zpe: 762963.4 jmol-1
zpe.correction: 0.290597 hartree
zpe.thermalcorrener: 0.308260 hartree
zpe.thermalcorrenthalpy: 0.309204 hartree
zpe.thermalcorrgfe: 0.242343 hartree
zpe.sumelectzpe: -823.662600 hartree
zpe.sumelectthermal: -823.644938 hartree
zpe.sumelectthermalent: -823.643994 hartree
zpe.sumelectthermalfe: -823.710854 hartree
dipole: -0.3110 -2.1628 -0.0769
dipole: 2.1864
quadrupole: -99.4739 -95.6764 -116.9577
quadrupole: 10.8790 5.7734 2.4272
quadrupole: 4.5620 8.3596 -12.9217 10.8790 5.7734 2.4272
hfenergy: -823.9531977 hartree
pointgroup: C01[X(C16H17N1O2)]
dipole: -0.0452026 -0.8523274 -0.1067931 debye
polarizability: 258.6540424|3.7595502|215.6753275|32.7651473|15.8085132|101.8103481 unknown
InChI: InChI=1S/C16H17NO2/c1-19-15-10-7-13(8-11-15)9-12-16(17-18)14-5-3-2-4-6-14/h2-8,10-11,18H,9,12H2,1H3
charge 0 multiplicity 1
36 atoms
O  -5.809969 -0.401323 -0.464853
O  3.625124 2.991128 0.252915
N  2.224904 2.643756 -0.035805
C  -0.230392 0.409245 0.787184
C  0.510648 1.079826 -0.412842
C  -1.698148 0.156056 0.478003
C  1.990334 1.340559 -0.131491
C  2.930409 0.192762 0.008793
C  -2.638835 1.223029 0.483072
C  -2.168278 -1.135861 0.145253
C  -3.991949 1.008629 0.167357
C  -3.525371 -1.375105 -0.177662
C  -4.440111 -0.294614 -0.166986
C  2.552748 -1.081644 -0.513318
C  4.195435 0.293023 0.66374
C  3.400113 -2.20161 -0.398342
C  5.033178 -0.834925 0.790604
C  4.646683 -2.0861 0.259133
C  -6.322809 -1.728253 -0.808997
H  -0.126991 1.076593 1.664338
H  0.272259 -0.540497 1.045947
H  0.033305 2.049701 -0.63611
H  0.38775 0.451181 -1.315076
H  -2.305338 2.234524 0.746688
H  -1.465606 -1.978878 0.143967
H  -4.719338 1.826264 0.176053
H  -3.850344 -2.390088 -0.425666
H  1.595489 -1.198364 -1.031196
H  4.511499 1.255171 1.066542
H  3.088243 -3.16381 -0.819712
H  5.996683 -0.732935 1.302737
H  5.305026 -2.956803 0.354584
H  -5.835509 -2.125948 -1.720959
H  -7.396622 -1.581903 -0.997358
H  -6.185144 -2.443811 0.025446
H  3.591526 3.981323 0.212215
