program: Gaussian 09
title: 000219404
version: EM64L-G09RevD.01
frameworkgroup: C1[X(C10H20N2O)]
method: RPBEPBE
basis: SDD
operation: Freq
keyword: #p
keyword: freq=noraman
keyword: PBEPBE/SDD
title: #p freq=noraman PBEPBE/SDD
converged: YES YES NO NO
title: Mulliken charges:
elementType: O N N C C C C C C C C C C H H H H H H H H H H H H H H H H H H H H
charge: -0.445152 -0.144096 -0.073630 -0.088068 -0.482228 -0.390856 -0.397528 0.110929 -0.505825 -0.312549 -0.380788 -0.716555 -0.698926 0.225880 0.215392 0.219375 0.212120 0.202862 0.206606 0.208239 0.233205 0.253929 0.183142 0.241023 0.222417 0.222147 0.225101 0.213165 0.215444 0.223204 0.223992 0.215962 0.362065
chargesum: 0.00000
title: Mulliken charges with hydrogens summed into heavy atoms:
elementType: O N N C C C C C C C C C C
charge: -0.083087 -0.144096 -0.073630 0.137813 -0.047462 0.024126 0.017317 0.110929 -0.018691 0.111616 0.063777 -0.062845 -0.035767
polarizability: 1.39701260e+02 -9.47236322e+00 1.27898050e+02 -2.12452129e+00 5.12051030e+00 1.09895541e+02
1716.lowfreq: -20.0413 -5.4752 -0.0009 -0.0008 -0.0003 10.2236 41.9237 49.0836 72.3042
frequency: 41.8638 48.7544 72.2759 101.8824 125.7350 148.1785 183.4488 206.9998 230.4177 256.5770 279.1149 292.3051 312.8105 347.4856 363.9662 408.6482 414.1382 451.6085 465.0689 484.7727 561.1878 633.4080 651.9031 742.7446 758.9076 773.4083 798.6117 816.8130 835.1895 858.5656 891.9579 903.2462 930.9855 953.0280 982.7702 1019.8788 1037.8997 1057.3041 1074.1227 1079.6161 1096.7122 1112.0680 1127.4744 1137.6290 1189.0870 1194.1026 1227.8084 1237.3855 1253.4802 1276.8739 1293.2821 1300.2618 1311.5569 1319.0176 1332.4543 1338.8538 1344.1768 1350.4865 1358.5417 1372.8844 1378.6531 1386.8126 1447.2412 1455.9454 1458.2172 1466.4346 1469.2347 1473.0727 1481.3326 1481.8263 1493.9932 1504.8391 1617.8570 2868.9932 2886.8305 2977.4624 2980.0796 2982.4932 2986.2818 2991.1923 2997.6614 3007.5333 3029.8795 3036.1343 3042.8469 3048.2641 3054.4343 3073.8558 3076.7024 3082.2963 3084.7445 3094.2301 3569.4578
redmass: 2.9640 2.4928 4.4927 2.7621 2.8345 2.0095 2.0484 1.2114 2.0959 2.7556 1.8154 2.6035 3.5931 3.7649 2.2937 2.0002 1.3500 2.0298 2.6268 2.8291 3.0674 3.3053 2.7560 2.6636 2.3933 1.3159 1.2185 1.9618 2.4148 3.4634 1.8692 2.3144 1.8778 2.5120 2.4258 2.2179 1.9095 2.1055 1.9265 1.9502 1.5411 1.6382 2.0934 1.3496 2.1243 2.2481 1.4748 1.5223 1.3481 1.1676 1.2797 1.3535 1.4206 1.2504 1.3719 1.5826 1.2593 1.3994 1.4945 1.2824 1.2520 1.2616 1.0887 1.0739 1.0849 1.0502 1.0704 1.0708 1.0478 1.0502 1.0778 1.0712 7.1068 1.0722 1.0812 1.0605 1.0351 1.0356 1.0609 1.0649 1.0643 1.0616 1.0869 1.0989 1.0993 1.1001 1.1021 1.0986 1.0985 1.1005 1.1004 1.0973 1.0674
irintensity: 0.3535 0.0897 0.3072 0.2204 0.7410 0.6296 0.8468 0.1740 0.6056 0.9431 0.7188 1.9407 7.2159 9.3779 0.9980 12.2379 110.1903 10.7716 4.3200 4.0102 13.1398 14.2184 4.2057 12.4396 3.8880 8.1084 17.4286 7.0566 32.1662 79.0273 30.8610 5.6949 3.9986 17.3390 29.4453 37.9455 0.8085 10.5642 10.5865 3.6434 1.8412 6.4778 11.9553 6.1494 19.9275 72.0487 17.7900 2.0075 3.2470 18.8859 3.7349 1.9711 8.9870 1.0802 10.7360 4.3802 1.6886 8.2403 16.3298 12.0191 21.4236 20.6353 15.6325 19.4722 2.3733 10.7300 0.0216 17.9678 2.9276 7.0499 14.6375 8.3884 6.0306 64.5553 72.0406 34.6192 25.8665 30.4763 43.7247 28.6877 13.8190 32.7332 7.7890 41.4632 31.6285 28.1837 64.8483 38.0093 69.7804 29.5586 60.0278 11.1588 36.9850
temp: 298.150 k
press: 1.00000 atm
elementType: 8 7 7 6 6 6 6 6 6 6 6 6 6 1 1 1 1 1 1 1 1 1 1 1 1 1 1 1 1 1 1 1 1
symmnumber: 1
zpe: 764165.9 jmol-1
zpe.correction: 0.291055 hartree
zpe.thermalcorrener: 0.305660 hartree
zpe.thermalcorrenthalpy: 0.306605 hartree
zpe.thermalcorrgfe: 0.249812 hartree
zpe.sumelectzpe: -576.658802 hartree
zpe.sumelectthermal: -576.644197 hartree
zpe.sumelectthermalent: -576.643253 hartree
zpe.sumelectthermalfe: -576.700045 hartree
dipole: -0.9723 0.6639 -0.1152
dipole: 1.1829
quadrupole: -78.7788 -77.1881 -81.5147
quadrupole: -0.7500 -1.3427 0.9516
quadrupole: 0.3818 1.9724 -2.3542 -0.7500 -1.3427 0.9516
hfenergy: -576.9498576 hartree
pointgroup: C01 [X(C10H20N2O1)]
dipole: 0.3604411 0.2896996 0.0525378 debye
polarizability: 137.9430556|10.3032145|130.1097301|-1.8220605|-4.4133064|109.4420649 unknown
InChI: InChI=1S/C10H20N2O/c1-3-12(4-2)10-8-6-5-7-9(10)11-13/h10,13H,3-8H2,1-2H3
charge 0 multiplicity 1
33 atoms
O  -2.866258 -2.121044 0.624448
N  1.159556 0.009305 -0.248984
N  -1.617481 -1.490201 1.118361
C  0.052109 0.205685 0.742222
C  -0.389834 1.694341 0.865769
C  -0.976329 2.238696 -0.457963
C  -2.187953 1.393576 -0.918685
C  -1.188486 -0.567391 0.286812
C  -1.82741 -0.119489 -1.008146
C  1.552818 -1.424184 -0.354499
C  2.309922 0.93784 -0.09597
C  2.474065 -1.723458 -1.551726
C  3.106644 0.848502 1.235689
H  0.33325 -0.171802 1.755256
H  0.449308 2.322448 1.217113
H  -1.16566 1.737779 1.656012
H  -0.196782 2.21429 -1.243734
H  -1.280731 3.295332 -0.327286
H  -2.548384 1.741366 -1.905544
H  -3.024509 1.522246 -0.202913
H  -1.084301 -0.257771 -1.817228
H  -2.717844 -0.72833 -1.231818
H  2.02914 -1.797194 0.586939
H  0.622736 -2.008696 -0.472332
H  2.997635 0.752069 -0.940497
H  1.945565 1.971805 -0.233727
H  2.039729 -1.314182 -2.481733
H  3.487151 -1.300335 -1.42717
H  2.586962 -2.81662 -1.672021
H  2.468026 1.072791 2.10967
H  3.543912 -0.155604 1.383756
H  3.936995 1.579075 1.228955
H  -3.049365 -2.777745 1.344074
