program: Gaussian 09
title: 000219403
version: EM64L-G09RevD.01
frameworkgroup: C1[X(C9H10N2O2)]
method: RPBEPBE
basis: SDD
operation: Freq
keyword: #p
keyword: freq=noraman
keyword: PBEPBE/SDD
title: #p freq=noraman PBEPBE/SDD
converged: NO NO NO NO
title: Mulliken charges:
elementType: O O N N C C C C C C C C C H H H H H H H H H H
charge: -0.252345 -0.418796 -0.436739 -0.071598 0.489244 0.458277 -0.446903 -0.338600 -0.378890 -0.373895 0.213623 -0.327846 -0.798593 0.218592 0.309517 0.229640 0.264688 0.309601 0.236488 0.237251 0.270752 0.237293 0.369238
chargesum: 0.00000
title: Mulliken charges with hydrogens summed into heavy atoms:
elementType: O O N N C C C C C C C C C
charge: -0.252345 -0.049558 -0.127138 -0.071598 0.489244 0.458277 -0.228310 -0.029083 -0.149250 -0.109207 0.213623 -0.091358 -0.053297
polarizability: 2.45739996e+02 9.50534139e+00 1.19518511e+02 3.12600442e-03 -1.24541051e-03 5.17631395e+01
1716.lowfreq: -60.8549 -6.2473 -4.8557 -0.0014 -0.0007 0.0006 11.6144 50.7456 69.7755
frequency: -60.8540 50.7369 69.5777 93.3666 107.8361 139.5537 179.0604 234.5854 268.9029 322.9933 392.7935 397.4927 416.9990 422.0336 435.2137 533.8011 549.5794 583.3578 631.5300 648.7186 655.8544 740.0095 812.8763 824.2934 853.3383 874.2765 912.2069 928.3950 936.6993 960.8666 983.6502 1006.0688 1006.7672 1031.1192 1125.3847 1188.8337 1211.1044 1215.8675 1230.7040 1268.6208 1310.0653 1365.2152 1375.2077 1389.8874 1422.0214 1447.7104 1467.7979 1491.7481 1514.9453 1566.2364 1591.8022 1622.9555 1633.1930 2985.2634 3055.3740 3070.3824 3105.0251 3136.3655 3136.7200 3155.9824 3196.5839 3518.6359 3581.9847
redmass: 1.0581 4.5144 5.0870 5.9936 3.3234 5.0363 4.9206 5.0853 5.9306 5.5946 3.3867 4.8562 2.9709 1.2104 4.6167 2.4618 4.6475 2.9443 7.0533 1.1776 5.7029 3.5550 4.2577 1.4142 4.8056 1.4052 8.5578 6.6860 1.4000 1.4791 1.6895 1.3294 2.5985 1.6583 1.3660 1.1453 1.5175 2.9721 1.4393 2.0664 1.4089 5.1883 1.2491 1.6069 3.9719 1.1667 1.0468 1.9219 3.0640 5.1606 5.7793 5.5862 5.3210 1.0383 1.0895 1.0984 1.0880 1.0959 1.0978 1.0910 1.0951 1.0764 1.0675
irintensity: 0.0740 1.1038 8.5851 0.7670 0.0328 0.0017 9.4563 0.0592 0.5067 1.1102 11.1512 10.2345 9.1069 160.7753 9.8950 33.3777 1.0162 1.1244 0.4125 61.8294 32.0835 0.1246 19.9880 44.3240 48.5234 41.5938 173.8411 34.9680 20.7298 16.4592 28.6360 0.6071 0.4896 8.2818 11.2671 24.5580 59.8525 117.3734 1.7654 49.8066 54.3024 181.6001 70.0616 26.6803 57.9944 48.0159 20.0938 100.6975 310.5922 38.5357 34.1010 85.8921 104.8328 8.8520 19.6544 15.2295 21.0628 15.6950 9.7497 1.2234 3.9197 12.9022 96.9525
temp: 298.150 k
press: 1.00000 atm
elementType: 8 8 7 7 6 6 6 6 6 6 6 6 6 1 1 1 1 1 1 1 1 1 1
symmnumber: 1
zpe: 462872.1 jmol-1
zpe.correction: 0.176299 hartree
zpe.thermalcorrener: 0.188177 hartree
zpe.thermalcorrenthalpy: 0.189121 hartree
zpe.thermalcorrgfe: 0.137619 hartree
zpe.sumelectzpe: -607.928939 hartree
zpe.sumelectthermal: -607.917061 hartree
zpe.sumelectthermalent: -607.916117 hartree
zpe.sumelectthermalfe: -607.967618 hartree
dipole: 1.8560 3.8466 0.0004
dipole: 4.2710
quadrupole: -62.9156 -71.2299 -79.6933
quadrupole: 16.4168 0.0035 -0.0015
quadrupole: 8.3640 0.0497 -8.4137 16.4168 0.0035 -0.0015
hfenergy: -608.1052379 hartree
pointgroup: C01 [X(C9H10N2O2)]
dipole: 0.7112781 1.5223648 -0.003718 debye
dipolederiv: -0.6220851 -0.094628 0.0002169 0.6542891 -0.9616881 0.0015861 -0.0016022 0.0014881 -0.3375472 -1.8435465 -0.3568888 0.0007322 0.2865596 0.0156947 -0.0010121 -0.0009848 -0.001109 -0.3979955 -2.0840346 0.3432578 -0.000975 0.6483283 -0.4652821 0.0004189 -0.0016762 0.0003445 -0.3200917 1.0314805 0.3307755 -0.0006732 -0.4188956 -0.217743 0.0000154 0.001342 0.00013 -0.188606 1.4108665 -0.0715723 0.0003121 0.1920576 0.0354696 0.0001409 -0.000365 0.0001493 0.0999449 -0.175236 0.051896 -0.0001494 0.156441 -0.1086743 0.0003412 -0.0004076 0.000341 0.0094235 -0.3769127 0.0391245 -0.0001224 0.3288634 0.0478432 -0.0006565 -0.0009034 -0.0007051 -0.2042772 -0.3649734 -0.0278038 0.0000619 -0.2973062 -0.0483849 -0.0003384 0.0007285 -0.0002853 -0.1586622 0.1554849 -0.0067043 0.0000521 -0.0199657 0.1032411 -0.0007241 0.0001186 -0.0007398 -0.1632534 0.1126565 0.0134172 -0.000014 0.0030481 0.0842366 -0.0005869 -0.0000026 -0.0005646 -0.1261308 1.8136606 -0.1652691 0.0004853 -1.2112873 1.300692 -0.0028482 0.0031658 -0.0027264 0.1690185 0.5411303 -0.0277192 0.0001536 -0.2608197 0.1142916 -0.0004766 0.0007283 -0.0004647 -0.0502345 -0.4797537 -0.0981708 0.0002101 -0.2318894 -0.0695035 0.0002389 0.0003423 0.0002385 0.0587165 -0.008423 -0.121522 0.0003128 -0.1112827 -0.0592493 0.0006133 0.0002825 0.0006224 0.1674354 0.1461554 0.0457422 -0.0001391 0.0166307 0.0632643 0.0003243 -0.0000671 0.0003098 0.1784773 0.012148 0.1083917 -0.0003111 0.0898954 -0.0408657 0.0005491 -0.0002697 0.0005544 0.1562048 0.0684162 -0.0593088 0.0001579 -0.0474655 -0.0056658 0.0004215 0.0001356 0.0004141 0.1490252 0.1604763 0.0112502 -0.0000375 -0.0280128 0.0939384 0.0005223 0.0000256 0.0005441 0.3018401 0.0041187 0.0271863 -0.0001012 0.0949642 -0.0762127 0.0007284 -0.0002885 0.0007242 0.1927976 0.0445731 -0.002759 -0.0154629 -0.0403393 0.0377645 0.1094332 0.0392292 0.1064238 -0.0313813 0.0130735 0.0496734 -0.0000719 0.1230226 0.0031219 0.0002311 -0.000162 0.0002567 0.1318998 0.044536 -0.002752 0.0154073 -0.0405268 0.0369638 -0.1096412 -0.0390547 -0.1066471 -0.0305232 0.3961885 0.0143835 -0.0000441 0.1136912 0.1167477 0.0007194 -0.0003146 0.0007011 0.3939194 unknown
polarizability: 245.4833552|11.0760727|119.774689|-0.0070036|-0.1770167|51.7636026 unknown
InChI: InChI=1S/C9H10N2O2/c1-7(12)11-9-4-2-8(3-5-9)6-10-13/h2-6,11,13H,1H3
charge 0 multiplicity 1
23 atoms
O  3.247575 -1.652137 0.004381
O  -5.31478 -0.563275 0.000842
N  2.519173 0.583915 -0.001094
N  -3.880421 -0.838603 0.001819
C  1.105521 0.445383 -0.000892
C  -1.746056 0.318045 -0.000892
C  0.329057 1.636863 -0.00423
C  0.446064 -0.817934 0.002493
C  -1.074496 1.572359 -0.004209
C  -0.957689 -0.868407 0.002444
C  3.504354 -0.413171 0.001402
C  -3.211955 0.297571 -0.001052
C  4.930922 0.141799 0.000051
H  0.828051 2.615385 -0.006883
H  1.043456 -1.730922 0.005052
H  -1.658095 2.501063 -0.006821
H  -1.466481 -1.837795 0.005035
H  2.862944 1.54778 -0.003453
H  -3.747929 1.261577 -0.003708
H  5.118649 0.760928 -0.897227
H  5.63581 -0.701657 0.001564
H  5.118924 0.764338 0.894908
H  -5.713198 -1.470004 0.003071
