program: Gaussian 09
title: 000219402
version: EM64L-G09RevD.01
frameworkgroup: C1[X(C6H8O6)]
method: RPBEPBE
basis: SDD
operation: Freq
keyword: #p
keyword: freq=noraman
keyword: PBEPBE/SDD
title: #p freq=noraman PBEPBE/SDD
converged: YES YES NO NO
title: Mulliken charges:
elementType: O O O O O O C C C C C C H H H H H H H H
charge: -0.226121 -0.440650 -0.425123 -0.510589 -0.166725 -0.188064 -0.072968 -0.171592 -0.223903 -0.118670 0.190874 -0.043338 0.283215 0.256811 0.271796 0.248313 0.353407 0.208115 0.382105 0.393108
chargesum: 0.00000
title: Mulliken charges with hydrogens summed into heavy atoms:
elementType: O O O O O O C C C C C C
charge: -0.226121 -0.087243 -0.043017 -0.117481 -0.166725 -0.188064 0.210246 0.085219 0.047893 0.129643 0.190874 0.164777
polarizability: 9.14098457e+01 1.14266771e+00 8.03381744e+01 -2.82289040e+00 -1.89780346e+00 6.84329315e+01
1716.lowfreq: -14.4815 -11.1686 -0.0009 -0.0008 0.0005 10.0981 64.1296 67.2712 101.4329
frequency: 63.9833 67.2625 101.4122 138.2169 187.6192 223.1373 250.4468 274.7702 300.8161 322.2314 329.5820 362.9313 461.2043 469.6429 549.9655 594.3029 656.7481 679.2060 710.7176 743.5336 757.7429 807.3084 820.1998 884.5107 931.9373 969.7725 988.0152 1005.2326 1014.1681 1032.2808 1084.6123 1103.1201 1177.8836 1192.0636 1209.3414 1251.4531 1259.5701 1265.5753 1296.5567 1306.8156 1342.4375 1371.0127 1382.2136 1439.3105 1625.9227 1727.5411 2957.2183 2977.9047 3013.1171 3060.4227 3083.7514 3257.1983 3371.7187 3570.6929
redmass: 6.2179 9.0173 6.3578 7.8881 3.5885 6.3863 7.1625 8.5948 6.4656 1.5027 2.6662 5.2259 7.0424 4.7191 1.1205 5.1154 8.5244 4.2623 2.6587 2.1077 2.5079 6.0744 3.1521 3.4651 2.7223 3.8559 2.6414 3.7433 4.2784 2.7104 3.6560 3.1683 1.2177 1.3618 1.3716 1.1985 1.3003 1.3034 1.3985 1.3515 1.2048 1.3655 1.5370 1.1558 8.5477 12.7973 1.0818 1.0903 1.0865 1.0866 1.0870 1.0677 1.0642 1.0664
irintensity: 0.4695 0.1700 0.2947 4.8933 12.4772 7.1317 1.8956 6.5455 1.0544 121.7989 43.0285 12.6752 2.2065 3.6264 107.4228 6.9562 16.2148 2.6300 55.6582 111.4407 26.6275 34.3847 69.6193 58.4941 31.1122 97.7424 62.1453 15.2718 51.1783 19.6757 44.0978 101.4281 73.2694 17.3621 25.1429 7.8729 2.5734 18.9263 29.6434 1.2697 17.5013 28.6239 9.5888 108.0347 110.6463 301.8848 12.6047 60.6720 29.9026 11.8134 21.8763 292.6229 72.3055 11.6914
temp: 298.150 k
press: 1.00000 atm
elementType: 8 8 8 8 8 8 6 6 6 6 6 6 1 1 1 1 1 1 1 1
symmnumber: 1
zpe: 376981.3 jmol-1
zpe.correction: 0.143585 hartree
zpe.thermalcorrener: 0.155049 hartree
zpe.thermalcorrenthalpy: 0.155994 hartree
zpe.thermalcorrgfe: 0.106086 hartree
zpe.sumelectzpe: -683.806530 hartree
zpe.sumelectthermal: -683.795065 hartree
zpe.sumelectthermalent: -683.794121 hartree
zpe.sumelectthermalfe: -683.844029 hartree
dipole: 1.2150 6.1032 0.9986
dipole: 6.3025
quadrupole: -66.3282 -73.9176 -77.0802
quadrupole: -2.4350 -1.2907 -1.8813
quadrupole: 6.1138 -1.4756 -4.6382 -2.4350 -1.2907 -1.8813
hfenergy: -683.9501149 hartree
pointgroup: C01 [X(C6H8O6)]
dipole: 1.761963 -1.1060629 1.3492944 debye
dipolederiv: -1.2330288 -0.0630091 -0.3411895 -0.2775013 -0.4933269 -0.1674424 -0.4229638 0.0018624 -0.4735161 -0.5422869 0.0667504 0.1132154 0.0676968 -0.322988 0.2645181 0.0923838 0.2889309 -0.7455094 -0.5244911 0.0833028 0.0789475 0.0420509 -0.5286589 0.0249832 0.0569064 0.0281889 -0.6817616 -0.6866194 -0.0993373 0.0219728 -0.0784448 -0.4463137 -0.1525942 0.0352475 -0.0708588 -0.6786723 -1.0039322 0.1447547 -0.2473278 0.3533152 -0.5501287 0.0945208 -0.3072868 0.0466662 -0.382385 -0.3396016 -0.1146551 0.0202116 -0.2498981 -0.6631664 0.1105312 0.1523257 0.2320914 -0.5994397 0.6226586 -0.0004714 0.09997 -0.2844707 0.1773923 -0.0553365 -0.0256375 -0.1617772 0.2871218 0.2670013 -0.0259712 -0.1981355 0.0968848 0.2917236 -0.1944285 -0.1253386 -0.2145215 0.4739931 0.1981449 0.0065901 -0.1727615 -0.0010372 0.0764172 -0.0276623 -0.1053508 0.0265336 0.4220875 0.2323341 -0.1176556 0.0521006 -0.2505525 -0.2540188 0.11108 0.0908576 0.1162568 0.4571317 1.658495 -0.0890151 0.6196395 0.0706346 0.814198 0.1281687 0.7474923 0.0447474 0.455477 0.2520731 0.2315384 -0.0251742 0.4451823 0.9453334 -0.1851447 -0.0607626 -0.1310361 0.661382 -0.0039146 0.0099202 -0.0502716 0.0139884 0.0817871 -0.0364223 -0.0744116 -0.0161835 -0.0287732 -0.0602196 0.0823072 0.0613068 0.1046288 -0.0256647 -0.0089341 0.0665475 -0.0037354 -0.0311168 -0.0153486 -0.0701716 0.0526303 -0.0717943 0.0133372 0.0348554 0.0351036 0.0122364 0.0465327 -0.0519307 0.0319392 -0.0810747 0.0849678 0.0365364 0.0481961 -0.0640417 -0.015099 0.0015578 0.2993093 -0.1393357 0.0096101 -0.1279558 0.1236816 -0.0700062 -0.0137473 -0.1175145 0.3064797 0.1049251 -0.0322641 -0.0264733 -0.0424914 0.016506 -0.0468078 -0.0551202 -0.0885488 -0.1492284 0.4880942 0.0907604 0.0000162 0.0967679 0.3810296 -0.0130308 0.0161273 0.0136684 0.3234432 0.3383379 0.004023 0.0127872 0.0080286 0.3263236 0.1409565 -0.038331 0.0080923 0.3351962 unknown
polarizability: 84.7161741|9.4864559|79.4005098|3.4368617|-4.9064614|76.0642677 unknown
InChI: InChI=1S/C6H8O6/c7-1-2(8)5-3(9)4(10)6(11)12-5/h1-5,8-10H
charge 0 multiplicity 1
20 atoms
O  -0.646594 1.062698 0.456363
O  -0.669995 -1.575837 2.11569
O  -0.826292 -1.515042 -1.627732
O  1.410787 0.021886 -1.404031
O  -2.696834 0.907981 -0.637137
O  2.266914 2.501255 -1.015756
C  0.433739 0.134564 0.873233
C  -0.159731 -1.293487 0.769999
C  -1.279653 -1.155183 -0.294583
C  1.670482 0.37994 -0.016077
C  -1.688705 0.340112 -0.211673
C  2.109969 1.847613 0.041792
H  0.669473 0.35252 1.929448
H  0.580781 -2.050068 0.445107
H  -2.153286 -1.792881 -0.087977
H  2.503399 -0.242135 0.38023
H  -1.139805 -2.447728 2.118793
H  2.285097 2.28581 1.04862
H  0.026575 -1.006223 -1.801879
H  1.614677 0.832007 -1.958632
