program: Gaussian 09
title: 000219401
version: EM64L-G09RevD.01
frameworkgroup: C1[X(C8H6N2O2)]
method: RPBEPBE
basis: SDD
operation: Freq
keyword: #pfreq=noraman
keyword: PBEPBE/SDD
title: #p freq=noraman PBEPBE/SDD
converged: YES YES YES YES
title: Mulliken charges:
elementType: O O N N C C C C C C C C H H H H H H
charge: -0.279020 -0.279021 -0.334084 -0.334084 0.149409 0.149410 0.154719 0.154718 -0.333711 -0.333711 -0.213871 -0.213871 0.279442 0.279443 0.337514 0.337514 0.239602 0.239602
chargesum: 0.00000
title: Mulliken charges with hydrogens summed into heavy atoms:
elementType: O O N N C C C C C C C C
charge: -0.279020 -0.279021 0.003430 0.003430 0.149409 0.149410 0.154719 0.154718 -0.054268 -0.054268 0.025731 0.025731
polarizability: 1.37118131e+02 -9.04501918e-06 1.30775303e+02 -3.19432271e-04 -3.15565455e-03 4.11586329e+01
1716.lowfreq: -11.3313 -5.4918 -0.0006 -0.0004 0.0004 4.7138 102.1475 110.8965 190.2212
frequency: 102.1474 110.8961 190.2210 219.1677 251.2329 325.9228 348.1246 413.1007 447.9156 459.3366 479.4017 537.7964 570.4670 580.4445 648.7749 689.5926 690.0544 754.9904 783.3809 796.5145 799.4018 920.0713 996.8830 1011.8924 1015.4909 1049.6087 1069.2417 1126.9405 1170.9800 1198.4299 1251.3335 1301.5383 1337.7681 1377.8227 1397.6284 1443.6299 1465.3578 1469.1741 1568.9887 1603.8319 1622.1366 1636.0726 3138.5395 3152.0512 3163.8589 3173.7528 3544.4456 3554.4572
redmass: 9.6581 3.9555 4.8639 10.3724 6.5870 1.3274 11.3864 2.9685 7.7216 11.4065 2.7341 8.1062 1.2201 5.1048 4.9501 3.6906 6.2399 6.9686 4.8789 6.0828 1.4389 1.4077 1.3784 3.6872 1.3411 2.2193 4.1531 1.7465 1.1171 2.4534 1.6841 2.1690 8.1757 1.5593 8.6499 2.1590 2.6627 2.5168 6.9085 5.1880 6.1212 7.0724 1.0863 1.0900 1.0950 1.1005 1.0796 1.0796
irintensity: 12.3222 0.0000 5.0419 0.0002 0.9613 0.0001 20.8099 16.9164 0.3633 1.4314 0.0001 3.8513 179.4032 0.2663 0.0000 140.5030 0.2795 4.1582 0.0000 1.8864 53.8678 0.0000 4.5670 53.8003 0.0000 27.4627 0.0890 37.1624 15.8145 55.0790 15.6805 17.9797 78.2315 14.7048 19.7826 5.8444 1.9666 0.1060 0.0210 469.8775 142.6532 13.4177 3.7830 4.4140 1.6508 21.4367 5.2833 136.4201
temp: 298.150 k
press: 1.00000 atm
elementType: 8 8 7 7 6 6 6 6 6 6 6 6 1 1 1 1 1 1
symmnumber: 1
zpe: 340701.3 jmol-1
zpe.correction: 0.129766 hartree
zpe.thermalcorrener: 0.139048 hartree
zpe.thermalcorrenthalpy: 0.139992 hartree
zpe.thermalcorrgfe: 0.095264 hartree
zpe.sumelectzpe: -567.570361 hartree
zpe.sumelectthermal: -567.561080 hartree
zpe.sumelectthermalent: -567.560136 hartree
zpe.sumelectthermalfe: -567.604864 hartree
dipole: 0.2674 0.0000 -0.0001
dipole: 0.2674
quadrupole: -43.8807 -87.8108 -71.1775
quadrupole: 0.0000 0.0007 -0.0003
quadrupole: 23.7423 -20.1878 -3.5545 0.0000 0.0007 -0.0003
hfenergy: -567.7001277 hartree
pointgroup: C01 [X(C8H6N2O2)]
dipole: -0.1052147 0.0000081 -0.000035 debye
dipolederiv: -0.5633006 0.1288445 0.0000427 0.0781675 -1.2943147 -0.0002717 0.0000172 -0.0006354 -0.3738319 -0.5633232 -0.1289241 -0.0000353 -0.078247 -1.2942915 -0.000421 -0.0000331 -0.0002301 -0.3738323 -0.5433501 -0.4929706 -0.0005039 0.3518849 -0.3212321 -0.0002205 -0.0007506 -0.0000959 -0.3123995 -0.5433343 0.4929944 0.0004042 -0.3518612 -0.3212462 -0.0001358 0.0007643 -0.0002273 -0.3123993 -0.1803246 0.1697752 0.0000657 0.3076578 -0.1378115 -0.0000653 0.0001092 -0.0000733 0.0125384 -0.1803747 -0.1697702 -0.0000507 -0.3076533 -0.137759 -0.0000732 -0.0002239 -0.0000389 0.0125387 1.0348373 0.2425223 0.0002435 -0.0904755 1.5306367 0.0005598 0.0001255 0.0007954 0.2316699 1.0348191 -0.2424684 -0.0002291 0.0905293 1.5306516 0.0006513 -0.0000301 0.0005279 0.2316696 -0.1957442 -0.0866642 -0.0000185 0.0561048 0.0689795 0.0000595 -0.0000118 0.0000716 -0.11013 -0.1957421 0.0866933 0.0000253 -0.0560759 0.0689743 0.0000672 -0.0000351 0.0000539 -0.1101306 0.1530192 0.1318101 0.0000636 0.0498306 -0.0203062 0.0000525 0.0000402 0.0000513 -0.13865 0.1529993 -0.1318288 -0.0000362 -0.0498488 -0.0202857 0.0000343 -0.0000013 0.0000337 -0.1386499 0.1227477 0.0277016 0.0000098 -0.0290707 -0.0007211 -0.0000455 -0.0000219 -0.0000461 0.1590296 0.122748 -0.0277154 -0.0000129 0.0290571 -0.0007201 -0.0000513 0.0000252 -0.0000429 0.1590299 0.2368515 -0.0274258 0.0000844 -0.0308586 0.1268151 -0.0000309 0.0003223 -0.0000399 0.3746878 0.2368578 0.0274138 -0.000036 0.0308468 0.1268088 -0.0000368 -0.000274 -0.0000216 0.3746879 -0.0647021 -0.0785516 -0.0000351 -0.08763 0.04792 -0.0000408 -0.0000325 -0.0000526 0.1570859 -0.0646838 0.0785639 0.0000184 0.0876422 0.0479018 -0.0000317 0.0000104 -0.0000298 0.157086 unknown
polarizability: 137.1181306|-0.0003537|130.7752917|0.0003266|0.0318088|41.158644 unknown
InChI: InChI=1S/C8H6N2O2/c11-7-5-3-1-2-4-6(5)8(12)10-9-7/h1-4,9-10H
charge 0 multiplicity 1
18 atoms
O  -1.133437 2.755883 0.001122
O  -1.133737 -2.755748 -0.000807
N  -2.195469 0.706141 0.000051
N  -2.195546 -0.70589 0.000094
C  0.229498 0.712909 0.000192
C  0.229421 -0.712921 -0.000247
C  -1.042168 1.489517 0.000274
C  -1.04233 -1.489391 -0.00048
C  1.457418 1.41815 0.000504
C  1.457263 -1.418297 -0.000426
C  2.674326 0.709838 0.000337
C  2.674249 -0.710117 -0.000138
H  1.425051 2.51246 0.000838
H  1.424776 -2.512602 -0.000769
H  -3.104664 1.173898 0.000727
H  -3.104792 -1.173548 -0.000268
H  3.623837 1.255552 0.000564
H  3.6237 -1.255935 -0.00027
