program: Gaussian 09
title: 000219399
version: EM64L-G09RevD.01
frameworkgroup: C1[X(C4H8N2O)]
method: RPBEPBE
basis: SDD
operation: Freq
keyword: #pfreq=noraman
keyword: PBEPBE/SDD
title: #p freq=noraman PBEPBE/SDD
converged: NO NO NO NO
title: Mulliken charges:
elementType: O N N C C C C H H H H H H H H
charge: -0.280713 -0.396918 -0.507538 -0.332628 0.233689 -0.065853 -0.736186 0.213117 0.256561 0.234022 0.234025 0.225295 0.314509 0.304308 0.304309
chargesum: 0.00000
title: Mulliken charges with hydrogens summed into heavy atoms:
elementType: O N N C C C C
charge: -0.280713 -0.082410 0.101079 -0.119511 0.233689 0.190708 -0.042843
polarizability: 9.85806469e+01 4.62179675e+00 5.80377296e+01 -4.09549272e-04 5.77935163e-04 3.65382250e+01
1716.lowfreq: -3.0429 -0.0006 -0.0001 0.0006 9.4618 16.1225 80.7036 120.4969 144.0978
frequency: 80.5923 120.1652 144.0960 152.6217 202.7360 250.2824 278.3266 371.9206 430.6395 537.5400 679.8524 730.1966 792.3969 836.9397 913.6144 981.4833 984.7022 1054.0230 1080.7240 1143.4222 1239.3305 1285.8096 1287.8933 1322.2055 1394.0953 1437.4305 1458.5839 1466.8542 1606.6756 1675.3749 1683.9803 2967.4100 3040.4876 3079.4513 3099.0945 3112.4135 3381.7158 3492.6453 3549.7315
redmass: 2.5253 1.2673 3.6508 1.4237 1.5439 2.8514 4.2983 3.8348 4.3273 1.1815 2.5179 3.5914 1.8568 2.0723 1.9320 1.0726 4.1461 1.5872 1.9589 2.9006 2.1167 1.1590 1.3281 1.6407 1.2314 1.6570 1.0473 1.0740 7.9565 4.4521 1.1244 1.0370 1.0959 1.0979 1.0939 1.0893 1.0428 1.0982 1.0794
irintensity: 0.1058 24.2873 0.6288 0.8989 0.0143 6.8753 26.4219 1.4309 5.0646 187.4645 0.5030 6.8344 135.5375 4.2870 37.3750 68.8386 2.4233 0.3174 9.3317 3.5543 40.5012 0.0568 24.2121 23.1755 14.3218 147.8135 16.5223 45.8468 154.1895 82.1956 23.4393 21.2660 19.1427 17.4482 10.3176 19.7220 0.1228 1.2910 33.6049
temp: 298.150 k
press: 1.00000 atm
elementType: 8 7 7 6 6 6 6 1 1 1 1 1 1 1 1
symmnumber: 1
zpe: 319088.7 jmol-1
zpe.correction: 0.121534 hartree
zpe.thermalcorrener: 0.130096 hartree
zpe.thermalcorrenthalpy: 0.131040 hartree
zpe.thermalcorrgfe: 0.088519 hartree
zpe.sumelectzpe: -341.360932 hartree
zpe.sumelectthermal: -341.352370 hartree
zpe.sumelectthermalent: -341.351426 hartree
zpe.sumelectthermalfe: -341.393947 hartree
dipole: 1.5727 -2.3088 0.0001
dipole: 2.7935
quadrupole: -35.9668 -43.8767 -42.3060
quadrupole: -1.3789 -0.0005 0.0002
quadrupole: 4.7497 -3.1602 -1.5895 -1.3789 -0.0005 0.0002
hfenergy: -341.482466 hartree
pointgroup: C01 [X(C4H8N2O1)]
dipole: -0.6678206 0.8728938 0.0000526 debye
dipolederiv: -0.67867 0.1479778 0.0000217 0.0559395 -0.9551725 -0.0001604 -0.0000106 0.0001621 -0.3771085 -0.5023422 -0.3667816 0.0000141 -0.5725097 -0.4021388 -0.0000916 0.0000023 -0.0001642 -0.4911679 -0.3020278 -0.1643373 0.0000387 -0.2524246 -0.3474457 0.000005 0.0000284 0.0000002 -0.0365712 -0.758584 0.0008078 0.0000106 -0.1374609 0.0488962 -0.0000009 0.0000866 -0.0000125 -0.2433884 1.4368087 0.257362 0.0000297 0.1920544 1.173774 0.0002252 -0.000089 -0.0000348 0.2631092 0.5334581 0.0188524 -0.0000706 0.1213161 0.0996554 -0.0000124 -0.0000021 -0.0000127 -0.1422179 -0.2981381 0.0317766 0.0000203 -0.0767894 0.0651456 -0.0000069 0. 0.0000036 0.0587001 0.0293043 0.0208377 0.0000125 0.0525282 -0.1259713 0.0000143 0.0000403 0.0000049 0.1763676 0.0729548 0.048933 0.0000088 0.0353592 -0.0400181 0.0000039 0.0000057 0.0000015 0.1568894 -0.0116383 -0.0308675 0.081893 0.0244773 0.0821401 0.085904 0.131219 0.0727244 -0.0333762 -0.0116756 -0.0308847 -0.0819001 0.0244596 0.0821289 -0.0859116 -0.1312046 -0.0727278 -0.0333131 0.0582445 -0.0295479 0.0000069 0.0794003 -0.1495453 0.0000042 0.0000066 0.0000128 0.1108206 0.0844067 0.0605881 -0.0000553 0.116123 0.1301514 0.0000154 -0.0000462 0.0000318 0.3662225 0.1739556 0.0176586 0.0579392 0.1688009 0.1692471 0.1453912 0.0500573 0.087592 0.112475 0.1739435 0.017625 -0.0579695 0.1687261 0.1691531 -0.1453793 -0.0500936 -0.0875813 0.1125588 unknown
polarizability: 97.9493126|6.8233829|58.6690639|0.0004408|-0.0005545|36.538225 unknown
InChI: InChI=1S/C4H8N2O/c1-2-3-4(7)6-5/h2-3,6H,5H2,1H3
charge 0 multiplicity 1
15 atoms
O  0.904561 -1.206968 -0.000013
N  1.648617 0.995641 -0.00001
N  3.026154 0.657442 0.000147
C  -0.748396 0.602933 -0.000176
C  0.632276 0.032476 -0.000331
C  -1.839859 -0.20968 -0.000017
C  -3.274498 0.248131 0.000107
H  -0.862171 1.696273 -0.000196
H  -1.65148 -1.293668 0.000008
H  -3.811302 -0.143702 0.886417
H  -3.811492 -0.143775 -0.886055
H  -3.363668 1.348419 0.000072
H  1.443528 1.995696 -0.000061
H  3.260827 0.111891 0.843145
H  3.260902 0.111588 -0.842637
