program: Gaussian 09
title: 000219391
version: EM64L-G09RevD.01
frameworkgroup: C1[X(C12H6Cl2N2)]
method: RPBEPBE
basis: SDD
operation: Freq
keyword: #p
keyword: freq=noraman
keyword: PBEPBE/SDD
title: #p freq=noraman PBEPBE/SDD
converged: NO NO NO NO
title: Mulliken charges:
elementType: Cl Cl N N C C C C C C C C C C C C H H H H H H
charge: -0.030978 -0.030978 0.055071 0.055070 -0.139827 -0.139827 0.455345 0.455345 -0.384308 -0.384308 -0.188350 -0.188350 -0.168250 -0.168249 -0.364028 -0.364028 0.256407 0.256408 0.257007 0.257007 0.251911 0.251911
chargesum: 0.00000
title: Mulliken charges with hydrogens summed into heavy atoms:
elementType: Cl Cl N N C C C C C C C C C C C C
charge: -0.030978 -0.030978 0.055071 0.055070 -0.139827 -0.139827 0.455345 0.455345 -0.127901 -0.127900 -0.188350 -0.188350 0.088757 0.088757 -0.112117 -0.112117
polarizability: 2.66850594e+02 7.06327879e-06 1.85492510e+02 1.16334190e-02 2.47671967e-04 5.89640658e+01
1716.lowfreq: -4.3347 -0.0030 -0.0018 -0.0017 0.3360 3.1101 55.0589 64.0326 133.1325
frequency: 55.0540 64.0182 133.1325 159.3695 189.3483 227.6019 239.4685 250.4074 266.1553 359.6736 375.2989 445.3625 452.9776 477.0402 486.5620 540.0579 544.6066 580.0893 593.9325 626.1933 660.2619 739.5881 757.9731 768.7361 824.5825 835.2050 848.9912 849.3537 853.0763 853.4206 952.3201 954.0409 987.9444 1034.0435 1056.4168 1075.1232 1120.4880 1179.4186 1211.1718 1211.7857 1223.5453 1290.8217 1329.6463 1331.8771 1361.1244 1371.4435 1397.5266 1422.5132 1455.9282 1480.5203 1495.6451 1562.3926 1584.2900 1609.0733 3134.7771 3135.2944 3148.0770 3169.6898 3175.8781 3176.0449
redmass: 8.1206 6.7163 21.6148 5.9846 7.3299 11.6436 5.0764 4.2671 9.4046 11.2699 9.2123 3.8163 8.6267 3.4747 8.8210 5.7219 5.2372 8.1428 3.5129 7.6066 8.4073 3.3435 6.9281 8.8033 2.6681 1.3791 1.9149 7.1145 5.8606 1.5681 1.4301 1.4362 1.3102 2.5512 5.5835 2.2094 2.8610 1.5462 2.1302 2.0146 2.1931 4.5690 2.5006 9.1504 1.8213 2.8326 1.9182 4.2907 4.1950 3.7578 6.1490 7.8369 8.5370 7.0759 1.0901 1.0903 1.0867 1.0973 1.0960 1.0960
irintensity: 0.0000 0.0899 0.1991 11.0602 0.0000 2.1535 0.0000 3.2034 0.2234 1.0035 11.9415 0.0000 0.9092 2.0675 0.0033 5.6595 4.8271 9.7080 0.0000 0.0000 16.7191 7.0815 54.5473 43.7588 0.0000 27.5403 0.0001 7.4763 24.0366 91.5951 0.0111 0.0000 0.0000 1.0133 39.6141 0.9520 16.5895 5.8241 0.1723 21.5662 1.4269 10.8715 14.6889 2.8000 0.9445 9.1774 54.0458 18.0616 122.6935 16.8388 84.8473 49.1345 4.8534 18.0651 16.9005 20.8013 1.9983 4.5511 6.5271 1.9427
temp: 298.150 k
press: 1.00000 atm
elementType: 17 17 7 7 6 6 6 6 6 6 6 6 6 6 6 6 1 1 1 1 1 1
symmnumber: 1
zpe: 386970.4 jmol-1
zpe.correction: 0.147389 hartree
zpe.thermalcorrener: 0.159461 hartree
zpe.thermalcorrenthalpy: 0.160405 hartree
zpe.thermalcorrgfe: 0.108065 hartree
zpe.sumelectzpe: -1489.426225 hartree
zpe.sumelectthermal: -1489.414154 hartree
zpe.sumelectthermalent: -1489.413210 hartree
zpe.sumelectthermalfe: -1489.465550 hartree
dipole: 0.0000 -1.1032 0.0000
dipole: 1.1032
quadrupole: -89.4604 -107.0981 -108.0834
quadrupole: 0.0000 0.0012 0.0000
quadrupole: 12.0869 -5.5508 -6.5361 0.0000 0.0012 0.0000
hfenergy: -1489.5736147 hartree
pointgroup: C01 [X(C12H6Cl2N2)]
dipole: 0.0000081 -0.4340312 -0.0000055 debye
dipolederiv: -0.4120933 0.2998206 -0.0000032 0.4712086 -0.5624964 -0.0000009 0.0000212 -0.0000214 -0.0524501 -0.4120619 -0.2998144 -0.0000049 -0.4712024 -0.5625275 -0.0000015 0.0000159 0.0000157 -0.05245 -0.504807 -0.0841282 -0.0000247 -0.0429364 -0.3087804 -0.0000124 -0.0000337 -0.0000224 -0.200005 -0.5048108 0.0841196 -0.0000266 0.0429279 -0.3087748 0.000012 -0.0000342 0.0000225 -0.2000051 0.3528183 0.2167541 0.0000339 -0.1532557 0.164831 0.0000025 0.0000298 0.0000276 0.0309953 0.35282 -0.2167467 0.0000329 0.1532638 0.1648274 -0.0000023 0.0000319 -0.0000269 0.0309951 -0.283989 0.2177099 -0.0000146 0.4360455 -0.2739654 0.0000034 -0.0000174 -0.0000117 0.0948972 -0.283961 -0.2177098 -0.0000157 -0.4360469 -0.2739911 -0.0000047 -0.0000182 0.0000098 0.0948973 -0.0675916 -0.1051525 -0.0000022 0.0800962 0.0733619 0.0000151 0.0000048 0.0000129 -0.1401191 -0.0675942 0.1051465 -0.0000023 -0.0801011 0.0733622 -0.0000149 0.0000024 -0.0000132 -0.1401193 0.746758 -0.444457 0.0000166 -0.7496582 0.9158682 0.0000106 -0.0000084 0.0000387 -0.0647077 0.7467087 0.4444501 0.0000198 0.7496514 0.9159165 -0.0000051 -0.000003 -0.00003 -0.0647078 -0.1212437 0.0987827 -0.0000073 0.0489116 -0.5013937 -0.0000203 -0.0000155 -0.0000268 -0.0580332 -0.1212376 -0.0987673 -0.0000066 -0.0488969 -0.5013998 0.0000187 -0.0000165 0.0000253 -0.0580331 0.2776452 -0.0903738 0.0000221 0.1074742 0.4301268 0.0000328 0.000039 0.00003 -0.0673455 0.2776444 0.0903686 0.0000253 -0.1074791 0.4301251 -0.0000331 0.0000464 -0.0000336 -0.0673456 0.0619497 0.0753851 -0.0000011 0.0085525 0.0011464 -0.0000037 -0.0000036 0.0000022 0.1572918 0.061953 -0.0753824 -0.0000007 -0.0085499 0.0011432 0.0000034 -0.0000027 -0.000002 0.157292 -0.0429182 -0.0138622 -0.0000081 0.006419 0.1170255 -0.0000002 -0.0000045 -0.0000043 0.1679148 -0.042919 0.0138559 -0.0000088 -0.0064253 0.1170258 0. -0.0000057 0.0000039 0.1679148 -0.0065318 -0.0725722 -0.0000115 -0.0986644 -0.0557194 -0.0000163 -0.0000117 -0.0000091 0.1315614 -0.0065382 0.0725735 -0.0000123 0.0986655 -0.0557115 0.0000167 -0.0000162 0.0000129 0.1315619 unknown
polarizability: 266.8505942|0.0016571|185.4925098|0.0116334|0.0002479|58.9640658 unknown
InChI: InChI=1S/C12H6Cl2N2/c13-9-3-5-15-11-7(9)1-2-8-10(14)4-6-16-12(8)11/h1-6H
charge 0 multiplicity 1
22 atoms
Cl 3.838652 -2.086858 0.000144
Cl -3.838565 -2.087014 -0.000117
N  1.386171 1.870065 0.000173
N  -1.386244 1.870009 -0.000129
C  0.734673 0.655501 0.000082
C  -0.734697 0.655471 -0.000043
C  1.433885 -0.613081 0.000096
C  -1.433857 -0.613139 -0.000058
C  0.690823 -1.848367 0.000035
C  -0.690745 -1.848395 -0.000004
C  2.864641 -0.555572 0.00019
C  -2.864616 -0.555688 -0.00015
C  3.528486 0.671884 0.000247
C  -3.52851 0.671741 -0.000209
C  2.734832 1.857688 0.000267
C  -2.734905 1.857578 -0.00022
H  1.243578 -2.792947 0.000029
H  -1.243461 -2.792997 0.000002
H  4.620139 0.732737 0.000272
H  -4.620165 0.73255 -0.000242
H  3.229989 2.835282 0.000349
H  -3.230101 2.835151 -0.000312
