program: Gaussian 09
title: 000019407
version: EM64L-G09RevD.01
frameworkgroup: C1[X(C7H14N2O4)]
method: RPBEPBE
basis: SDD
operation: Freq
keyword: #p
keyword: freq=noraman
keyword: PBEPBE/SDD
title: #p freq=noraman PBEPBE/SDD
converged: YES YES NO NO
title: Mulliken charges:
elementType: O O O O N N C C C C C C C H H H H H H H H H H H H H H
charge: -0.309231 -0.309224 -0.270827 -0.270822 -0.363668 -0.363665 -0.391431 -0.217483 -0.217477 0.317918 0.317906 -0.674268 -0.674268 0.242009 0.292459 0.321027 0.321022 0.230590 0.226675 0.226664 0.230602 0.211972 0.227336 0.228437 0.211972 0.228437 0.227337
chargesum: 0.00000
title: Mulliken charges with hydrogens summed into heavy atoms:
elementType: O O O O N N C C C C C C C
charge: -0.309231 -0.309224 -0.270827 -0.270822 -0.042641 -0.042643 0.143037 0.239782 0.239789 0.317918 0.317906 -0.006522 -0.006523
polarizability: 1.35445452e+02 -5.51565604e-04 8.80742575e+01 -3.06361103e-04 2.79755031e+00 9.68510428e+01
1716.lowfreq: -33.9409 -6.9063 -5.0187 -0.0007 -0.0005 -0.0001 4.4565 20.7103 34.5442
frequency: -33.9223 20.6852 34.1473 34.7488 68.3772 81.8127 115.9897 118.3082 154.6081 163.0218 243.5649 244.3214 254.9920 290.1887 316.7125 346.4484 374.5227 480.7670 519.8536 532.5556 624.3298 663.0276 677.9306 698.0426 709.2305 800.1361 800.1886 814.5184 839.5228 900.6437 928.5359 1024.0641 1027.7865 1084.4328 1100.5664 1107.9555 1117.9922 1123.2026 1138.6550 1138.7438 1159.1568 1214.0810 1248.5370 1248.6668 1279.1389 1357.3665 1358.1219 1383.6124 1400.2986 1400.3486 1451.7378 1462.9036 1462.9269 1472.7557 1476.8844 1478.9884 1488.1810 1492.0201 1504.6578 1663.4937 1689.9464 2994.7143 2994.7654 3008.8658 3008.8947 3010.4101 3066.5687 3066.6130 3091.5828 3091.6316 3095.7018 3105.0717 3105.1593 3566.5699 3566.6928
redmass: 5.4431 3.2196 2.6438 2.4471 5.9064 3.0039 3.0833 4.5766 4.2908 3.4375 1.2157 1.2377 6.1126 2.6451 4.1586 3.5523 3.7191 4.1857 1.1360 2.1341 1.4924 5.5454 6.6234 11.6000 10.4034 1.0963 1.0980 3.1098 3.4384 3.6686 6.1865 2.4397 2.5959 4.4129 2.7204 2.8105 2.5568 4.1269 1.4651 1.4630 2.4448 2.6080 1.1319 1.1321 1.1265 1.3024 1.3166 1.1912 1.2647 1.2651 1.0760 1.0407 1.0407 1.3645 1.0587 1.1592 1.1233 1.1321 1.7223 8.1105 9.9879 1.0357 1.0357 1.0582 1.0585 1.0636 1.1067 1.1067 1.0985 1.0985 1.1009 1.1027 1.1027 1.0774 1.0771
irintensity: 3.1225 0.1853 0.1549 0.4431 8.0509 4.0664 5.5246 0.2559 0.8087 6.3480 1.3013 0.2147 31.6093 1.4142 3.8550 8.0029 5.1174 10.4192 129.1821 13.3601 158.9972 5.0370 25.8440 4.0249 65.4189 2.3339 5.0463 12.0622 5.7084 49.4275 192.8209 26.3805 199.4552 83.8391 10.5812 56.0959 3.3168 16.9220 0.2953 7.1078 697.2331 163.4478 0.0682 0.1748 223.2233 2.6434 1.6543 0.0137 33.6665 24.1123 29.5456 7.3627 15.7365 292.1169 10.3134 64.6207 26.1491 36.1546 127.9885 1.6017 474.5384 24.9181 19.9368 11.5480 44.5704 40.3183 4.8753 11.6608 12.8523 51.0937 0.9511 30.0316 69.4285 0.3885 53.8500
temp: 298.150 k
press: 1.00000 atm
elementType: 8 8 8 8 7 7 6 6 6 6 6 6 6 1 1 1 1 1 1 1 1 1 1 1 1 1 1
symmnumber: 1
zpe: 575297.3 jmol-1
zpe.correction: 0.219119 hartree
zpe.thermalcorrener: 0.233886 hartree
zpe.thermalcorrenthalpy: 0.234830 hartree
zpe.thermalcorrgfe: 0.174429 hartree
zpe.sumelectzpe: -684.524689 hartree
zpe.sumelectthermal: -684.509922 hartree
zpe.sumelectthermalent: -684.508977 hartree
zpe.sumelectthermalfe: -684.569379 hartree
dipole: 0.0006 0.5015 -4.3895
dipole: 4.4181
quadrupole: -60.3662 -71.7442 -81.3882
quadrupole: -0.0025 0.0006 6.7578
quadrupole: 10.8000 -0.5780 -10.2220 -0.0025 0.0006 6.7578
hfenergy: -684.7438078 hartree
pointgroup: C01 [X(C7H14N2O4)]
dipole: 0.0001824 -0.2398001 -1.7215824 debye
polarizability: 135.4454517|0.0011976|89.9723433|-0.0018553|4.5697537|94.9529571 unknown
InChI: InChI=1S/C7H14N2O4/c1-3-12-6(10)8-5-9-7(11)13-4-2/h8-9H,3-5H2,1-2H3
charge 0 multiplicity 1
27 atoms
O  3.099136 0.134603 -0.511728
O  -3.099467 0.134002 -0.511406
O  1.902562 -0.131643 1.50539
O  -1.902803 -0.13227 1.505662
N  1.231692 -1.156949 -0.509872
N  -1.232021 -1.157555 -0.509652
C  0.00003 -1.768919 -0.005627
C  4.088984 0.97937 0.216396
C  -4.088952 0.979271 0.216626
C  2.046827 -0.364039 0.28164
C  -2.047498 -0.365196 0.282063
C  5.123968 1.424483 -0.812051
C  -5.123571 1.424973 -0.811934
H  0.000269 -2.84278 -0.268332
H  0.000084 -1.658969 1.091733
H  1.505292 -1.271802 -1.486483
H  -1.505636 -1.272376 -1.486262
H  3.553894 1.831309 0.673126
H  4.534638 0.377525 1.029232
H  -4.535023 0.377619 1.029375
H  -3.553478 1.830909 0.673466
H  5.887547 2.057166 -0.323873
H  5.631041 0.554695 -1.264029
H  4.651324 2.010896 -1.61866
H  -5.886883 2.058031 -0.323826
H  -4.650516 2.011174 -1.618455
H  -5.63104 0.55547 -1.264019
