program: Gaussian 09
title: 000219386
version: EM64L-G09RevD.01
frameworkgroup: C1[X(C19H20O2)]
method: RPBEPBE
basis: SDD
operation: Freq
keyword: #pfreq=noraman
keyword: PBEPBE/SDD
title: #p freq=noraman PBEPBE/SDD
converged: YES YES NO NO
title: Mulliken charges:
elementType: O O C C C C C C C C C C C C C C C C C C C H H H H H H H H H H H H H H H H H H H H
charge: -0.229841 -0.249126 -0.432124 -0.520370 -0.526760 0.092051 0.131036 0.314435 0.308213 -0.381169 -0.346548 -0.358210 -0.350405 0.445082 0.442616 -0.408866 -0.402296 -0.383748 -0.383222 -0.806283 -0.803225 0.258980 0.225265 0.252905 0.235656 0.216714 0.252192 0.292189 0.236515 0.270171 0.275921 0.235345 0.234553 0.232295 0.235623 0.226884 0.238507 0.228617 0.229614 0.229076 0.241741
chargesum: 0.00000
title: Mulliken charges with hydrogens summed into heavy atoms:
elementType: O O C C C C C C C C C C C C C C C C C C C
charge: -0.229841 -0.249126 0.052121 -0.031809 -0.057855 0.092051 0.131036 0.314435 0.308213 -0.088980 -0.110033 -0.088039 -0.074484 0.445082 0.442616 -0.173521 -0.167743 -0.151454 -0.147599 -0.112275 -0.102795
polarizability: 3.22118788e+02 -1.84843687e+01 2.20166610e+02 -1.63892128e+01 -1.05397901e+01 1.14901979e+02
1716.lowfreq: -28.0625 -3.8481 -1.4498 -0.0008 -0.0004 0.0007 5.6943 12.7220 21.7318
frequency: -27.9965 12.4210 21.6077 25.6935 35.4466 45.4683 55.4895 84.4352 94.6207 102.1760 124.7618 200.0236 204.9264 246.8541 262.0616 303.5260 314.4898 337.2022 341.5750 344.6205 386.2469 404.4736 408.2369 453.3977 461.2169 477.8975 480.4838 543.5986 557.4829 623.8206 633.7172 634.4996 650.3897 682.4798 712.0270 737.1592 747.0697 794.3609 800.1846 826.5003 830.2666 852.1185 860.6916 863.3291 870.1599 939.4698 965.8086 978.2699 984.7960 989.8823 994.0634 995.4358 1000.4869 1009.3711 1012.6367 1031.6229 1046.7913 1046.9600 1052.1077 1070.5219 1123.1022 1127.0418 1144.9039 1159.0956 1192.5830 1200.4419 1225.4192 1226.3413 1234.5740 1256.0051 1278.1160 1298.7740 1306.6638 1316.7490 1340.9380 1343.1187 1371.6065 1371.8452 1395.1909 1397.3708 1410.8503 1411.8396 1457.6687 1464.5181 1467.9405 1468.1258 1471.8728 1473.2564 1473.6015 1503.5199 1505.2193 1547.8253 1553.2375 1583.0925 1585.9919 1618.9532 1619.7621 2974.9951 2976.9191 2990.6805 3001.8224 3014.9044 3056.4916 3056.8712 3059.0618 3077.3280 3086.7660 3087.5527 3090.0554 3122.7796 3125.1977 3126.1149 3128.0579 3144.8151 3154.5537 3156.5661 3159.7572
redmass: 1.0160 4.9623 1.7819 1.6657 4.6372 3.7264 4.2334 5.5982 4.4074 4.3545 6.4194 3.9490 4.0484 3.7331 3.9877 2.9437 4.0508 3.9450 3.2841 2.9647 2.3873 2.8233 2.8196 3.8610 3.2819 2.9061 3.0174 3.9024 3.4567 4.1356 6.8255 6.3085 4.2201 2.9748 3.5785 2.6363 2.9513 4.5024 4.5011 1.6143 1.5990 1.8065 1.4177 1.2448 2.2883 2.3059 1.3828 1.9958 1.3487 1.4085 1.6158 1.5215 1.3888 2.9783 2.5954 2.3910 1.5921 1.6009 2.5311 3.2335 1.3111 1.3217 1.2765 1.2085 1.1213 1.1641 2.9639 2.8658 1.4679 2.1995 2.2966 1.4650 1.3075 1.3058 1.4701 1.5328 4.7156 4.5126 1.2233 1.2207 3.7170 3.3227 1.1314 1.0948 1.1050 1.1075 1.0563 1.1044 1.1056 2.4217 2.4275 6.8118 6.8056 6.6110 6.8122 6.2755 6.3896 1.0390 1.0391 1.0622 1.0634 1.0606 1.1017 1.0943 1.0942 1.1031 1.0949 1.1000 1.1001 1.0888 1.0887 1.0885 1.0889 1.0966 1.0944 1.0956 1.0959
irintensity: 0.5959 2.7085 0.1343 0.8144 1.8955 0.1653 1.4381 3.8923 0.2741 0.2281 3.0273 5.3380 8.5166 3.3178 1.8020 3.1621 1.5808 0.1660 3.3431 2.6105 0.5854 0.1101 1.3932 8.3390 2.5612 2.6047 24.6075 24.9788 9.9705 1.2596 0.7196 0.3233 0.8401 12.4276 2.1169 18.1761 2.3047 3.5046 0.9356 40.5368 42.1641 20.9253 17.3776 1.0404 3.6631 73.3697 1.6646 5.0250 10.3731 1.4253 8.6357 1.7527 2.4856 6.1981 1.3875 5.0442 31.5887 15.8647 0.5119 24.1174 12.1031 11.8281 32.9021 11.6403 39.0442 34.7063 6.7091 5.1046 95.0755 91.9226 166.6630 88.4282 12.2883 3.0696 53.5929 4.9614 17.8558 6.5275 13.1437 14.6469 12.4044 16.7843 13.3166 17.4362 10.7431 23.8957 12.8060 6.2891 29.2342 3.0639 2.4688 167.6860 138.3994 29.3364 94.2385 68.8217 41.4305 30.5954 25.3284 21.5897 26.1355 12.8490 10.4320 22.6216 20.6012 33.0022 11.1067 18.8604 15.7358 24.1958 10.6299 11.3808 18.5499 18.3767 19.2876 14.2942 2.8011
temp: 298.150 k
press: 1.00000 atm
elementType: 8 8 6 6 6 6 6 6 6 6 6 6 6 6 6 6 6 6 6 6 6 1 1 1 1 1 1 1 1 1 1 1 1 1 1 1 1 1 1 1 1
symmnumber: 1
zpe: 879768.9 jmol-1
zpe.correction: 0.335086 hartree
zpe.thermalcorrener: 0.354824 hartree
zpe.thermalcorrenthalpy: 0.355768 hartree
zpe.thermalcorrgfe: 0.282555 hartree
zpe.sumelectzpe: -884.971797 hartree
zpe.sumelectthermal: -884.952059 hartree
zpe.sumelectthermalent: -884.951115 hartree
zpe.sumelectthermalfe: -885.024327 hartree
dipole: -3.5412 -1.7358 0.3969
dipole: 3.9637
quadrupole: -87.9363 -126.7758 -126.1272
quadrupole: -12.1514 -0.3318 -1.6106
quadrupole: 25.6768 -13.1627 -12.5141 -12.1514 -0.3318 -1.6106
hfenergy: -885.3068829 hartree
pointgroup: C01 [X(C19H20O2)]
dipole: -1.5139546 -0.1154793 -0.3555376 debye
polarizability: 279.2569936|62.381908|243.5994592|23.9363817|-35.9178061|134.3309249 unknown
InChI: InChI=1S/C19H20O2/c1-14-6-10-16(11-7-14)18(20)4-3-5-19(21)17-12-8-15(2)9-13-17/h6-13H,3-5H2,1-2H3
charge 0 multiplicity 1
41 atoms
O  3.405464 -1.163472 1.036012
O  -1.137384 0.971744 -0.150084
C  0.508933 -1.74679 0.650367
C  1.451599 -1.085054 -0.387164
C  -0.372803 -0.710842 1.420412
C  2.681076 -0.445484 0.277467
C  -1.417031 -0.088631 0.497421
C  3.049623 0.978413 -0.002572
C  -2.743964 -0.761141 0.302797
C  2.116584 1.939668 -0.480105
C  -3.101527 -1.974884 0.950788
C  4.386021 1.39166 0.261016
C  -3.684561 -0.163135 -0.581448
C  3.860687 3.684955 -0.458796
C  -5.302928 -1.968018 -0.156111
C  2.522933 3.273754 -0.693574
C  -4.359769 -2.566998 0.719572
C  4.784511 2.719315 0.028248
C  -4.939278 -0.756078 -0.805056
C  4.298983 5.111025 -0.735503
C  -6.668948 -2.589981 -0.375286
H  1.133714 -2.29557 1.379109
H  -0.141994 -2.487032 0.147617
H  0.904243 -0.375517 -1.027079
H  1.852726 -1.879639 -1.04805
H  -0.842823 -1.205369 2.288388
H  0.271709 0.099989 1.803904
H  1.065224 1.670707 -0.631541
H  -2.40039 -2.467661 1.632234
H  5.089107 0.648019 0.651339
H  -3.397787 0.768173 -1.081249
H  1.787616 4.008922 -1.042069
H  -4.617157 -3.50638 1.223308
H  5.820511 3.020037 0.226759
H  -5.651253 -0.280725 -1.49049
H  5.119579 5.421077 -0.064793
H  4.668483 5.214464 -1.774689
H  3.464198 5.82289 -0.612565
H  -7.060193 -2.364218 -1.382596
H  -6.640747 -3.686693 -0.252936
H  -7.401586 -2.1964 0.356295
