program: Gaussian 09
title: 000219378
version: EM64L-G09RevD.01
frameworkgroup: C1[X(C15H14O3)]
method: RPBEPBE
basis: SDD
operation: Freq
keyword: #pfreq=noraman
keyword: PBEPBE/SDD
title: #p freq=noraman PBEPBE/SDD
converged: YES YES NO NO
title: Mulliken charges:
elementType: O O O C C C C C C C C C C C C C C C H H H H H H H H H H H H H H
charge: -0.270587 -0.426355 -0.258544 0.203238 0.146646 0.409698 0.143314 -0.453396 -0.361921 -0.379790 -0.368507 -0.440047 -0.262979 -0.253533 0.234300 -0.763556 0.088522 -0.526755 0.242251 0.252335 0.256481 0.267408 0.240860 0.228668 0.229721 0.245380 0.237832 0.244229 0.240454 0.252521 0.222316 0.379795
chargesum: 0.00000
title: Mulliken charges with hydrogens summed into heavy atoms:
elementType: O O O C C C C C C C C C C C C C C C
charge: -0.270587 -0.046559 -0.258544 0.203238 0.146646 0.409698 0.143314 -0.211145 -0.109586 -0.123309 -0.101099 -0.199187 -0.034312 -0.023812 0.234300 -0.036114 0.088522 0.188537
polarizability: 2.42077865e+02 -5.64436035e+00 2.16282596e+02 7.16827778e+00 4.13345175e+00 9.93121183e+01
1716.lowfreq: -1.3291 -0.0007 -0.0006 -0.0006 3.3262 8.8833 43.3831 44.5341 55.5080
frequency: 43.3424 44.5079 55.5057 71.8014 84.8473 114.4328 163.4709 166.0338 179.2111 224.3909 233.9382 259.6755 303.0054 315.8075 337.9457 347.0537 411.8912 420.8990 446.4397 489.4883 499.7923 528.6541 535.4299 541.8314 581.4348 608.7660 620.7859 658.8466 690.9590 705.1933 728.1857 762.4289 773.2127 800.6441 833.2034 857.4882 883.8963 892.7740 931.9956 959.4857 978.1331 982.9805 993.2204 1005.7758 1028.8004 1039.8465 1047.3123 1083.3623 1102.7482 1148.3062 1154.5090 1158.6038 1172.6199 1192.0239 1223.3928 1237.5325 1271.2244 1296.8577 1336.4111 1365.9181 1396.5102 1404.1757 1408.7544 1425.5596 1434.8763 1457.8463 1459.8193 1464.0218 1467.6620 1471.3051 1512.7010 1564.4241 1601.7444 1605.3411 1625.0454 1643.9042 2976.1092 2991.0742 3071.1923 3076.4011 3109.3983 3112.8752 3118.3011 3121.8429 3132.8151 3134.3982 3153.0347 3166.3121 3172.3357 3521.7679
redmass: 5.7814 3.7818 5.7123 3.9676 4.2405 4.9256 3.2176 1.4350 2.7780 2.6811 3.7241 1.3584 4.0225 2.9332 4.8306 4.4359 3.4967 5.1613 3.3704 5.0466 5.5485 4.8124 3.7153 3.3706 4.2569 1.2865 4.0219 4.1025 5.3427 4.3589 5.6270 1.3515 3.3961 3.4503 1.4635 4.7890 1.7815 3.1852 1.8369 1.3378 1.4011 2.5529 1.3289 3.5999 2.4833 2.2854 1.4944 2.4559 1.2512 1.3839 1.3633 1.5954 1.1693 1.5836 2.6352 2.3493 1.6503 2.2156 4.4706 1.8610 2.2405 1.3472 4.0953 3.0073 1.6515 1.5000 1.1018 1.1749 1.0554 1.0646 3.7538 7.7089 7.5114 6.3712 6.5419 7.8217 1.0312 1.0384 1.0947 1.1042 1.0893 1.0999 1.0995 1.0863 1.0892 1.0889 1.0941 1.0992 1.0960 1.0640
irintensity: 2.1862 1.2923 0.2044 3.2401 2.1542 1.9382 1.6847 0.8945 2.2747 1.7745 5.6640 1.2013 2.1622 5.2571 1.3982 1.6252 8.0798 3.1271 25.1456 15.3954 12.0381 7.4167 11.5984 11.3964 21.6816 98.4623 1.1981 2.5958 3.6292 50.9060 10.8495 41.1997 2.8953 3.6401 77.6271 0.6550 6.0421 5.4660 36.6623 1.6069 2.3633 9.2731 0.1220 71.1393 358.9586 91.8524 3.7710 39.4630 0.6418 9.0214 18.9891 53.7896 14.5678 8.1547 127.1751 30.7676 4.5449 78.2656 27.7409 32.4189 42.4608 27.4047 12.0415 1.1345 7.6674 21.8154 19.8982 7.9097 17.0167 45.3335 25.7223 15.1069 307.4310 35.8748 13.1378 65.4167 54.7022 10.8049 11.3756 42.4455 7.1346 10.1077 22.7535 2.1866 2.2325 16.2875 27.2774 26.4505 10.0187 46.5519
temp: 298.150 k
press: 1.00000 atm
elementType: 8 8 8 6 6 6 6 6 6 6 6 6 6 6 6 6 6 6 1 1 1 1 1 1 1 1 1 1 1 1 1 1
symmnumber: 1
zpe: 656330.1 jmol-1
zpe.correction: 0.249983 hartree
zpe.thermalcorrener: 0.266474 hartree
zpe.thermalcorrenthalpy: 0.267418 hartree
zpe.thermalcorrgfe: 0.205360 hartree
zpe.sumelectzpe: -804.373280 hartree
zpe.sumelectthermal: -804.356790 hartree
zpe.sumelectthermalent: -804.355845 hartree
zpe.sumelectthermalfe: -804.417903 hartree
dipole: 0.3973 -0.3968 0.4954
dipole: 0.7487
quadrupole: -93.8431 -96.1965 -110.5925
quadrupole: 0.2526 -2.1195 -0.5946
quadrupole: 6.3676 4.0143 -10.3818 0.2526 -2.1195 -0.5946
hfenergy: -804.6232634 hartree
pointgroup: C01 [X(C15H14O3)]
dipole: -0.1462962 0.1273748 0.2216988 debye
polarizability: 240.8780938|-3.6104909|215.2881022|-15.9835429|10.7615115|101.5063831 unknown
InChI: InChI=1S/C15H14O3/c1-10(15(16)17)9-13-12-6-4-3-5-11(12)7-8-14(13)18-2/h3-9,16H,1-2H3
charge 0 multiplicity 1
32 atoms
O  0.361079 -3.215072 -0.21958
O  4.074237 1.684099 0.637928
O  3.884275 0.42463 -1.301525
C  -1.223319 0.247996 -0.11849
C  -0.155063 -0.735329 -0.26602
C  -2.565776 -0.175614 0.224964
C  -0.494773 -2.105321 -0.136705
C  -2.830544 -1.573517 0.404136
C  -1.005124 1.64989 -0.340043
C  -1.82562 -2.509869 0.217211
C  1.235969 -0.284875 -0.527233
C  -3.60725 0.796995 0.367467
C  -2.041583 2.578133 -0.203092
C  -3.355738 2.155433 0.163724
C  1.999209 0.521055 0.283388
C  1.588213 1.052143 1.637404
C  3.363375 0.83749 -0.231735
C  1.610313 -3.189278 -0.990249
H  -3.842211 -1.896213 0.675466
H  -0.010657 1.992735 -0.640842
H  -2.003518 -3.582744 0.333966
H  1.719654 -0.603698 -1.460168
H  -4.613887 0.451825 0.632562
H  -1.845603 3.640629 -0.385514
H  -4.158259 2.89277 0.272291
H  2.386393 0.879362 2.379668
H  1.419928 2.144915 1.604975
H  0.659077 0.572689 1.983033
H  1.954757 -4.234717 -0.988132
H  2.373384 -2.546397 -0.517343
H  1.431416 -2.860043 -2.030562
H  4.973646 1.853497 0.246954
