program: Gaussian 09
title: 000219376
version: EM64L-G09RevD.01
frameworkgroup: C1[X(C7H4BrN3O6)]
method: RPBEPBE
basis: SDD
operation: Freq
keyword: #p
keyword: freq=noraman
keyword: PBEPBE/SDD
title: #p freq=noraman PBEPBE/SDD
converged: YES YES NO NO
title: Mulliken charges:
elementType: Br O O O O O O N N N C C C C C C C H H H H
charge: 0.192167 -0.137456 -0.139621 -0.173416 -0.174732 -0.168093 -0.154374 -0.037614 0.010415 -0.000499 0.227405 0.493845 0.318956 0.629150 -0.689279 -0.568778 -0.748200 0.332886 0.242694 0.283225 0.261318
chargesum: 0.00000
title: Mulliken charges with hydrogens summed into heavy atoms:
elementType: Br O O O O O O N N N C C C C C C C
charge: 0.192167 -0.137456 -0.139621 -0.173416 -0.174732 -0.168093 -0.154374 -0.037614 0.010415 -0.000499 0.227405 0.493845 0.318956 0.629150 -0.689279 -0.235892 0.039037
polarizability: 2.00594120e+02 -8.60031246e-01 1.66657775e+02 -5.12291013e+00 1.67504887e+00 7.76986024e+01
1716.lowfreq: -4.3273 0.0004 0.0006 0.0008 5.0466 7.0613 36.7689 42.7095 46.5278
frequency: 36.7624 42.7011 46.5248 50.1252 73.8433 115.9281 138.5878 150.3981 155.9500 166.3349 196.3560 234.7867 279.2070 292.1399 311.5366 352.6482 369.9220 392.2161 424.8993 513.8314 528.8306 568.5823 603.2708 648.5930 680.0988 686.0335 722.0894 728.7602 741.1354 747.6065 793.1372 856.0503 911.5496 945.4616 1033.3806 1035.2946 1115.7134 1164.1536 1199.0726 1208.8875 1216.0475 1242.8818 1332.8574 1368.8891 1383.8170 1392.7960 1396.8319 1407.4976 1428.1004 1450.1325 1480.4983 1556.1259 1591.3735 3012.7845 3095.9781 3126.8892 3185.1502
redmass: 8.9623 15.9993 15.4547 18.6134 4.5896 6.5072 11.2083 1.3357 7.1899 14.6098 7.7030 22.7501 7.9970 7.4969 8.9108 6.7195 5.4824 5.7707 7.2329 7.7603 6.8648 7.5874 8.5659 7.3002 8.9993 11.4518 7.1553 8.8608 13.8927 5.5001 7.9279 8.7263 7.7777 1.6010 1.5130 1.5383 5.3280 3.2092 12.8455 13.2987 2.6326 13.8669 7.1518 7.0588 8.4313 7.6930 4.3831 1.8407 2.8038 1.1503 1.1284 8.0584 8.6943 1.0385 1.0953 1.1009 1.0922
irintensity: 0.0227 0.0266 0.4568 0.3942 4.4990 2.1424 2.3710 2.4769 1.4526 1.9264 2.3190 0.6228 0.2140 2.4123 0.6431 2.2212 1.6791 5.6591 3.3224 9.6929 1.2245 1.7127 8.2385 28.0996 13.7252 18.0855 3.8556 1.1095 5.0171 3.3929 12.1088 17.7288 69.2878 17.9340 1.8122 5.0557 5.7558 8.7828 278.3917 224.4177 31.0137 13.2864 27.0602 40.4547 58.6370 135.9947 85.1624 102.5873 17.7831 31.3453 17.7952 31.9552 57.3752 0.7477 2.4934 9.8321 24.2781
temp: 298.150 k
press: 1.00000 atm
elementType: 35 8 8 8 8 8 8 7 7 7 6 6 6 6 6 6 6 1 1 1 1
symmnumber: 1
zpe: 310616.7 jmol-1
zpe.correction: 0.118308 hartree
zpe.thermalcorrener: 0.134245 hartree
zpe.thermalcorrenthalpy: 0.135189 hartree
zpe.thermalcorrgfe: 0.072099 hartree
zpe.sumelectzpe: -896.686970 hartree
zpe.sumelectthermal: -896.671033 hartree
zpe.sumelectthermalent: -896.670089 hartree
zpe.sumelectthermalfe: -896.733178 hartree
dipole: 0.2550 -1.8497 0.0226
dipole: 1.8673
quadrupole: -117.5546 -121.4726 -107.5657
quadrupole: -4.8232 2.8757 -0.5609
quadrupole: -2.0236 -5.9416 7.9653 -4.8232 2.8757 -0.5609
hfenergy: -896.8052778 hartree
pointgroup: C01 [X(C7H4Br1N3O6)]
dipole: -0.3564011 -0.6420634 -0.0217972 debye
dipolederiv: -0.3950943 0.264363 -0.0511812 0.2929482 -0.0327194 0.0138178 -0.0685488 0.021255 0.1143579 -0.1700173 0.0046681 0.0363751 -0.0258277 -0.5594077 0.1781216 0.0467127 0.0053985 -0.6360777 -0.1744836 0.0089812 0.0328636 -0.0044102 -0.5548527 -0.1869755 0.0113772 0.000505 -0.64204 -0.5101695 0.1492652 0.0204824 0.1600707 -0.7659276 0.1805173 0.0301508 0.1444631 -0.2586409 -0.8043372 -0.0620038 0.1313824 -0.0343238 -0.4597316 0.1048165 0.0891451 0.1176941 -0.2499237 -0.4174213 -0.1512395 0.0707694 -0.0946937 -0.699961 -0.2522241 0.0803406 -0.1856405 -0.3521291 -0.6495637 -0.0828322 0.2242217 -0.095748 -0.3761231 -0.1006832 0.1411957 -0.1383583 -0.334345 0.1178334 -0.0324955 -0.0867225 0.0282591 1.015146 0.0055148 -0.0826142 -0.0092506 1.2068429 1.5417362 -0.3615697 -0.1665707 -0.3913281 1.1408304 -0.3477276 -0.1328434 -0.28978 0.2999319 1.1563771 0.5566583 -0.3325821 0.4023925 1.0787809 0.4268697 -0.2214376 0.3630776 0.5222325 0.4828808 0.2475776 0.0296538 -0.088867 0.2131108 0.0057875 0.0573915 -0.0297586 0.0231921 -0.5916364 -0.0656256 -0.0396091 0.0629993 0.1508764 0.0018901 -0.0200276 0.0013761 0.004318 -0.4998318 0.2120508 -0.0009618 0.1146146 -0.221742 0.0494657 -0.018442 0.0239452 0.0541771 -0.4771832 -0.0357322 0.0191003 0.0077187 -0.3561674 -0.0456746 -0.031415 -0.0322756 0.0952406 0.9358817 -0.4642099 0.0958911 -0.301859 0.3827677 -0.0500911 0.1655574 -0.0002126 -0.1214616 0.3156655 -0.0651136 0.0372389 0.0655177 -0.1857852 0.0031476 -0.1051433 -0.0271345 -0.0629052 -0.2427971 -0.2341999 -0.0121867 -0.0946388 -0.0113559 0.0184534 0.0800118 0.0770726 0.0291977 0.1430683 0.005994 -0.0162407 -0.0163375 0.1496551 -0.002077 0.0480051 0.0052818 0.1696864 0.0822936 0.0847461 0.0362718 0.0077673 -0.0492803 -0.0435176 -0.0157018 -0.0577689 0.082043 0.0918576 -0.0159297 0.026858 -0.0239055 0.0952761 -0.0169968 0.012923 -0.0234082 0.00739 0.0649413 0.0366474 -0.0550536 0.0296511 0.0466105 0.0575653 -0.0666372 0.0335189 0.0489132 unknown
polarizability: 196.9197572|-10.7900564|170.5097848|-2.7437583|0.7361602|77.5209548 unknown
InChI: InChI=1S/C7H4BrN3O6/c1-3-4(9(12)13)2-5(10(14)15)6(8)7(3)11(16)17/h2H,1H3
charge 0 multiplicity 1
21 atoms
Br 2.96244 -1.376716 0.193344
O  0.127021 -3.300354 1.138036
O  0.31215 -3.285427 -1.143414
O  -2.557312 2.714782 -0.404401
O  -3.637313 0.870557 0.388295
O  2.135403 2.981475 0.750261
O  3.360868 1.554618 -0.547049
N  0.190962 -2.710266 -0.000931
N  -2.579357 1.486316 -0.014974
N  2.299267 1.882494 0.096343
C  -1.232368 -0.674993 -0.044959
C  0.076892 -1.220384 0.001305
C  -1.28422 0.748185 -0.01009
C  1.137043 0.948044 0.064184
C  1.270669 -0.463286 0.056873
C  -0.130722 1.548919 0.041907
C  -2.443099 -1.578514 -0.132627
H  -0.219724 2.638173 0.065194
H  -2.170824 -2.594357 -0.456128
H  -2.945747 -1.642103 0.848306
H  -3.191329 -1.175665 -0.833273
