program: Gaussian 09
title: 000219372
version: EM64L-G09RevD.01
frameworkgroup: C1[X(C11H10N2O4)]
method: RPBEPBE
basis: SDD
operation: Freq
keyword: #p
keyword: freq=noraman
keyword: PBEPBE/SDD
title: #p freq=noraman PBEPBE/SDD
converged: YES YES NO NO
title: Mulliken charges:
elementType: O O O O N N C C C C C C C C C C C H H H H H H H H H H
charge: -0.268131 -0.283992 -0.227820 -0.164737 0.044783 -0.000551 0.368887 -0.205866 -0.000122 0.381124 0.258180 -0.537169 -0.291661 -0.176375 -0.363350 -0.496174 -0.532754 0.293775 0.285077 0.234295 0.250264 0.232671 0.257089 0.226033 0.247115 0.238605 0.230806
chargesum: 0.00000
title: Mulliken charges with hydrogens summed into heavy atoms:
elementType: O O O O N N C C C C C C C C C C C
charge: -0.268131 -0.283992 -0.227820 -0.164737 0.044783 -0.000551 0.368887 -0.205866 -0.000122 0.381124 0.258180 -0.243394 -0.006584 0.057921 -0.113086 0.219619 0.183772
polarizability: 2.15871535e+02 -8.19620906e+00 2.07052953e+02 -2.21991339e+00 2.12177089e+00 7.17854090e+01
1716.lowfreq: -11.6908 -0.5764 -0.0006 -0.0004 0.0004 6.9603 41.6159 54.7787 67.8382
frequency: 41.5972 54.7774 67.8330 89.0199 111.7957 140.5726 148.8003 164.9355 199.3673 214.7477 228.8017 272.2116 301.5986 328.6189 340.8716 372.3467 418.4131 435.7935 450.6741 482.4740 521.8099 564.2521 604.7175 657.4291 680.0883 701.8966 711.8521 719.8330 799.2828 804.5434 847.5674 882.4940 899.9076 922.6781 948.7203 980.1161 999.4616 1019.6153 1051.0584 1089.4868 1108.4747 1111.5578 1147.5535 1155.6440 1159.7768 1196.6033 1226.5167 1239.7833 1278.4539 1331.4167 1363.7993 1370.2585 1379.6959 1409.6478 1427.4116 1443.1639 1453.0480 1461.0954 1465.6777 1469.5371 1476.8438 1489.8309 1552.3876 1584.4497 1609.7046 2972.0383 3001.1569 3066.1193 3113.2926 3128.5934 3132.7328 3140.2369 3159.9381 3181.4477 3184.5612
redmass: 3.2694 7.2154 3.6401 3.6842 2.9381 3.0388 3.0683 3.4866 4.6782 2.7455 1.7695 2.1332 6.5102 4.9592 5.2724 6.4634 5.2653 4.9937 7.0435 6.2844 4.3013 5.1986 7.6761 6.0168 5.1342 7.4635 7.9168 7.0219 5.0944 1.6603 2.7832 7.5038 1.8054 8.7478 1.4621 6.8418 1.3618 4.7575 2.7861 3.2628 1.2383 1.2543 1.3532 1.4752 1.4540 8.5646 1.6867 2.6238 4.7211 6.5908 3.4023 3.7515 3.1487 3.8237 1.4295 1.2380 1.1595 1.7589 1.0844 1.0532 1.1192 4.1816 7.6274 6.1957 8.2276 1.0323 1.0306 1.1048 1.1021 1.0898 1.1006 1.1060 1.0912 1.0902 1.0981
irintensity: 2.0078 3.7763 7.6172 1.6053 0.8539 0.7904 4.8854 8.2291 5.2466 0.9842 2.0397 2.4578 1.3686 1.5204 1.8206 2.9963 4.3935 1.9767 1.7736 7.4778 0.1656 8.9452 6.1172 0.9248 5.6063 0.8011 46.8315 6.0358 9.6801 52.8512 2.4003 2.6681 21.8145 19.2282 0.0644 12.7014 0.7756 48.7509 77.6889 88.1738 4.2498 0.1021 5.1268 14.0830 25.3062 466.1279 14.3228 0.3042 255.9718 7.2929 116.7926 55.4997 46.0049 33.2351 18.0075 1.3727 51.7412 104.3329 20.0245 15.0357 24.5269 35.7441 146.8482 69.3477 20.9806 55.6668 69.1380 34.3213 30.7289 16.8821 18.1356 14.3774 14.5791 2.2052 11.6352
temp: 298.150 k
press: 1.00000 atm
elementType: 8 8 8 8 7 7 6 6 6 6 6 6 6 6 6 6 6 1 1 1 1 1 1 1 1 1 1
symmnumber: 1
zpe: 515976.4 jmol-1
zpe.correction: 0.196525 hartree
zpe.thermalcorrener: 0.211862 hartree
zpe.thermalcorrenthalpy: 0.212806 hartree
zpe.thermalcorrgfe: 0.153329 hartree
zpe.sumelectzpe: -834.218602 hartree
zpe.sumelectthermal: -834.203265 hartree
zpe.sumelectthermalent: -834.202321 hartree
zpe.sumelectthermalfe: -834.261798 hartree
dipole: 7.3166 3.1679 0.5304
dipole: 7.9906
quadrupole: -95.1829 -90.9161 -99.8762
quadrupole: -19.4730 4.8055 0.5009
quadrupole: 0.1421 4.4090 -4.5511 -19.4730 4.8055 0.5009
hfenergy: -834.4151269 hartree
pointgroup: C01 [X(C11H10N2O4)]
dipole: -2.9112105 -1.0931792 0.4614945 debye
polarizability: 215.0497226|-9.0677366|206.228187|-4.3980606|-14.2472265|73.4319878 unknown
InChI: InChI=1S/C11H10N2O4/c1-16-9-6-8(13(14)15)10-7(11(9)17-2)4-3-5-12-10/h3-6H,1-2H3
charge 0 multiplicity 1
27 atoms
O  -2.366464 -1.776441 0.113671
O  -2.859955 1.050544 -0.182455
O  1.757779 3.000976 -0.893197
O  3.06753 1.66275 0.414919
N  2.422118 -1.005779 -0.259056
N  1.982864 1.902812 -0.230802
C  -0.022966 -1.367395 -0.022559
C  1.137729 -0.504905 -0.143796
C  -1.356399 -0.827325 0.010601
C  0.891601 0.909594 -0.194876
C  -1.541972 0.572272 -0.127015
C  -0.408767 1.421344 -0.218597
C  0.207672 -2.780434 0.055178
C  1.511981 -3.267472 -0.020433
C  2.5870 -2.339688 -0.202227
C  -3.665249 -1.459149 0.750113
C  -3.056645 2.494442 -0.369283
H  -0.520253 2.503713 -0.318812
H  -0.651618 -3.446971 0.161496
H  1.7223 -4.339611 0.036545
H  3.616804 -2.699727 -0.312018
H  -4.135926 -2.44222 0.902537
H  -4.277982 -0.823452 0.094812
H  -3.507726 -0.954546 1.719466
H  -4.147346 2.627432 -0.408443
H  -2.603004 2.838721 -1.317448
H  -2.640205 3.069617 0.479178
