program: Gaussian 09
title: 000219365
version: EM64L-G09RevD.01
frameworkgroup: C1[X(C13H17NO4)]
method: RPBEPBE
basis: SDD
operation: Freq
keyword: #p
keyword: freq=noraman
keyword: PBEPBE/SDD
title: #p freq=noraman PBEPBE/SDD
converged: YES YES NO NO
title: Mulliken charges:
elementType: O O O O N C C C C C C C C C C C C C H H H H H H H H H H H H H H H H H
charge: -0.309989 -0.250146 -0.201263 -0.202517 0.027337 -0.053240 -0.444445 0.065574 -0.707690 -0.696551 -0.732146 0.202903 0.232748 -0.320893 -0.314090 -0.352304 -0.345412 0.387551 0.203821 0.220699 0.210765 0.232705 0.213080 0.213283 0.216803 0.216675 0.216256 0.210201 0.225444 0.250242 0.240621 0.282474 0.281675 0.290824 0.289003
chargesum: 0.00000
title: Mulliken charges with hydrogens summed into heavy atoms:
elementType: O O O O N C C C C C C C C C C C C C
charge: -0.309989 -0.250146 -0.201263 -0.202517 0.027337 0.150581 -0.012981 0.298280 -0.064524 -0.053419 -0.015838 0.202903 0.232748 -0.038418 -0.032416 -0.061479 -0.056409 0.387551
polarizability: 2.51410153e+02 7.95849551e+00 1.52141512e+02 -8.61159832e+00 1.77754567e+01 1.09430842e+02
1716.lowfreq: -9.7390 -4.1974 -3.2841 -0.0009 -0.0009 -0.0006 22.1465 23.6452 34.9079
frequency: 21.9989 23.5632 34.8212 57.2065 65.7022 76.9286 90.4284 117.5364 162.7612 187.6238 211.1299 224.1231 240.6227 255.0340 271.1811 279.0925 295.3574 342.0465 368.7141 389.8887 409.7566 425.0632 453.9630 470.9723 487.9790 516.6426 571.9094 623.5775 652.9750 677.8493 685.9788 759.4141 764.7328 786.6715 806.7793 824.4823 855.0768 863.8174 888.8357 901.4223 918.1924 957.0482 974.9143 1003.2648 1003.9512 1005.7711 1011.8149 1035.5254 1065.5684 1089.3043 1107.3439 1108.1280 1145.0944 1163.3817 1174.4011 1193.9747 1214.1954 1242.4085 1247.9916 1279.0583 1291.0157 1319.1305 1326.7281 1342.7745 1363.7846 1367.1315 1379.6159 1388.7937 1397.1016 1405.1041 1414.0319 1459.0484 1465.3987 1468.8036 1473.7801 1478.1004 1478.7085 1486.2835 1492.0200 1587.1492 1608.8348 1615.6665 2964.8749 2969.0262 2974.5468 2987.1294 2994.2317 3032.8252 3046.4044 3061.7684 3068.3794 3070.2515 3074.0047 3094.7889 3100.6501 3164.6996 3175.6056 3187.9603 3193.3425
redmass: 3.6319 4.3956 4.1283 6.0317 5.8216 5.1183 5.1268 3.4432 3.8196 6.3909 1.1101 1.2742 2.6331 3.9022 1.1394 5.3329 4.2030 2.5039 2.2487 3.2156 2.8806 2.8068 3.9175 3.2189 9.1039 5.7742 2.9310 7.1165 6.1724 8.1787 3.9325 5.7042 5.1027 5.2119 3.1526 4.7063 2.0668 1.2469 1.6699 1.7419 1.2144 1.4535 1.8869 1.8946 1.4461 2.5661 1.3673 1.4302 4.9859 3.2623 1.4184 1.5482 2.0611 2.1294 1.2361 1.9977 6.8132 1.7382 1.8898 1.5008 1.2632 1.4610 1.3978 1.4077 1.4665 7.7135 1.2135 1.2208 1.2149 8.1590 4.5852 1.0667 1.0456 1.0670 2.4096 1.0503 1.0562 1.0479 1.0541 9.3492 6.5764 9.6627 1.0791 1.0358 1.0362 1.0655 1.0361 1.0859 1.0999 1.0996 1.0996 1.0987 1.0993 1.0989 1.1006 1.0901 1.0890 1.0958 1.0973
irintensity: 0.0518 0.0918 0.0238 0.1579 0.2499 0.3815 4.0606 2.4625 2.6434 3.9606 0.4954 1.2590 1.4744 1.1800 0.0907 3.3073 0.6313 4.7690 0.1105 7.9389 0.0110 2.1012 3.2360 2.3180 6.5588 1.3454 3.2555 0.3953 0.0129 4.3505 56.8431 20.4368 3.9259 10.6287 17.7994 22.6536 5.4475 0.7290 53.9530 8.9816 1.5350 0.4114 2.7913 75.4804 18.0709 1.0577 0.0571 1.4793 302.8689 10.7134 26.1031 18.5039 22.5155 40.1421 2.8373 27.0262 497.2285 91.9081 84.4833 20.7019 0.7291 3.6757 2.1348 0.6252 3.7040 83.8822 15.4012 33.0686 15.4568 10.5429 62.5148 8.3395 1.3857 5.4651 4.5169 14.1450 1.0003 17.8833 22.7437 65.4965 9.0659 86.0846 14.9972 34.5307 23.8127 28.0632 16.3968 13.1852 22.8231 17.8882 28.1525 91.6250 65.5237 23.6278 19.2861 1.2948 1.0248 0.3599 0.5255
temp: 298.150 k
press: 1.00000 atm
elementType: 8 8 8 8 7 6 6 6 6 6 6 6 6 6 6 6 6 6 1 1 1 1 1 1 1 1 1 1 1 1 1 1 1 1 1
symmnumber: 1
zpe: 734833.0 jmol-1
zpe.correction: 0.279883 hartree
zpe.thermalcorrener: 0.298411 hartree
zpe.thermalcorrenthalpy: 0.299356 hartree
zpe.thermalcorrgfe: 0.230748 hartree
zpe.sumelectzpe: -859.801357 hartree
zpe.sumelectthermal: -859.782828 hartree
zpe.sumelectthermalent: -859.781884 hartree
zpe.sumelectthermalfe: -859.850492 hartree
dipole: 5.8570 -0.7381 -0.7554
dipole: 5.9515
quadrupole: -130.0347 -109.0848 -105.9665
quadrupole: -9.9514 -1.6281 -0.6165
quadrupole: -15.0061 5.9439 9.0622 -9.9514 -1.6281 -0.6165
hfenergy: -860.0812398 hartree
pointgroup: C01 [X(C13H17N1O4)]
dipole: 2.3135235 -0.2894599 -0.2155083 debye
polarizability: 252.1003476|2.4446445|134.8882794|5.0178813|27.8382862|125.9938807 unknown
InChI: InChI=1S/C13H17NO4/c1-9(2)8-10(3)18-13(15)11-4-6-12(7-5-11)14(16)17/h4-7,9-10H,8H2,1-3H3
charge 0 multiplicity 1
35 atoms
O  1.260801 0.008244 -0.43787
O  0.807918 1.709073 1.099963
O  -6.048563 0.418725 0.065503
O  -5.507127 -1.223262 -1.42216
N  -5.190873 -0.289832 -0.588616
C  4.654421 -1.472218 0.283557
C  3.421108 -1.113874 -0.599087
C  2.75254 0.239606 -0.276095
C  5.793847 -0.428074 0.193146
C  4.259923 -1.736066 1.757717
C  3.147302 1.397942 -1.202104
C  0.412668 0.82049 0.303085
C  -1.030241 0.503652 0.045641
C  -2.009422 1.255483 0.74541
C  -1.425655 -0.510664 -0.864705
C  -3.377917 1.001687 0.542934
C  -2.791564 -0.775906 -1.076654
C  -3.745875 -0.013437 -0.367723
H  5.047509 -2.425807 -0.127768
H  2.660423 -1.906785 -0.467204
H  3.717059 -1.127845 -1.666636
H  2.903182 0.528215 0.780441
H  5.49698 0.53599 0.647926
H  6.08662 -0.236577 -0.856388
H  6.689252 -0.784196 0.734994
H  3.47664 -2.51331 1.830586
H  5.135317 -2.078646 2.339739
H  3.876174 -0.822493 2.250174
H  2.881745 1.161897 -2.247986
H  2.642982 2.33283 -0.904546
H  4.237594 1.56328 -1.153515
H  -1.674896 2.031525 1.440682
H  -0.658077 -1.078955 -1.395554
H  -4.155107 1.563797 1.066588
H  -3.129291 -1.550292 -1.769875
