program: Gaussian 09
title: 000219360
version: EM64L-G09RevD.01
frameworkgroup: C1[X(C7H14O2)]
method: RPBEPBE
basis: SDD
operation: Freq
keyword: #pfreq=noraman
keyword: PBEPBE/SDD
title: #p freq=noraman PBEPBE/SDD
converged: YES YES NO NO
title: Mulliken charges:
elementType: O O C C C C C C C H H H H H H H H H H H H H H
charge: -0.244238 -0.242308 -0.044571 -0.424737 0.027312 -0.705206 -0.692824 -0.712422 0.009050 0.195160 0.228937 0.194034 0.240115 0.210601 0.210976 0.217343 0.219722 0.206961 0.217542 0.225685 0.242653 0.216323 0.203892
chargesum: 0.00000
title: Mulliken charges with hydrogens summed into heavy atoms:
elementType: O O C C C C C C C
charge: -0.244238 -0.242308 0.150589 -0.001767 0.267427 -0.066285 -0.048598 -0.027761 0.212941
polarizability: 8.66587921e+01 4.90525936e+00 8.21590863e+01 -1.56744303e+00 7.16705862e-01 7.49876542e+01
1716.lowfreq: -11.5293 -5.7880 0.0001 0.0007 0.0007 7.5367 30.2650 38.1771 92.9298
frequency: 29.7587 37.3714 92.8828 159.2175 203.1132 214.4763 223.9699 253.4829 266.4790 296.5460 341.2362 376.9752 407.9777 454.8760 558.9626 704.6956 745.7388 781.9115 872.8132 892.5197 920.4448 958.8225 959.4272 974.1000 1008.7396 1050.7812 1095.8536 1122.2632 1131.7930 1158.1777 1195.6800 1243.1705 1284.4090 1313.4987 1328.4229 1336.0010 1343.7921 1371.7386 1380.9418 1387.4157 1398.5619 1445.2014 1464.6871 1466.6772 1475.5897 1477.3838 1483.5096 1488.8248 1614.2539 2960.6729 2968.5182 2976.7883 2983.3610 2990.0952 3028.9589 3030.2040 3042.2875 3060.4520 3068.1591 3071.9243 3078.9357 3088.1336 3099.2855
redmass: 6.9973 2.9335 2.5472 3.5777 3.1676 1.1170 1.1192 1.2158 1.9944 2.6474 2.2700 1.9627 2.3565 2.9308 2.6002 4.3207 4.1976 2.8797 1.6690 1.8736 1.1957 1.5840 1.4738 2.0449 1.6682 1.3852 6.7692 2.0388 2.2497 2.0069 1.9171 1.1748 1.4080 1.3414 1.4395 1.4369 1.1244 1.4749 1.2097 1.2181 1.2198 1.0783 1.0456 1.0532 1.0509 1.0487 1.0494 1.0549 8.5780 1.0794 1.0357 1.0372 1.0611 1.0378 1.0908 1.0909 1.0952 1.0993 1.0998 1.0988 1.0996 1.0987 1.1008
irintensity: 1.5533 0.0563 0.0522 3.2610 5.3887 0.4064 1.1337 1.6518 3.8256 6.1554 1.6638 1.1400 7.8623 9.3941 10.1864 1.0082 7.7179 1.3777 5.3236 4.7929 1.4259 1.8676 0.3338 8.2246 16.1713 5.3925 311.9565 11.2542 4.3366 6.6329 8.6767 0.5411 4.3379 11.9895 5.0487 5.2904 3.3921 4.8623 20.6234 14.1470 16.9985 5.8599 2.5910 5.9564 9.3409 7.1414 28.0304 11.6879 247.9414 19.1277 31.6747 36.8522 19.3358 28.0623 63.7083 5.8517 20.6804 26.0379 22.8204 96.9590 39.1322 34.3250 22.2062
temp: 298.150 k
press: 1.00000 atm
elementType: 8 8 6 6 6 6 6 6 6 1 1 1 1 1 1 1 1 1 1 1 1 1 1
symmnumber: 1
zpe: 521828.7 jmol-1
zpe.correction: 0.198754 hartree
zpe.thermalcorrener: 0.210034 hartree
zpe.thermalcorrenthalpy: 0.210978 hartree
zpe.thermalcorrgfe: 0.161083 hartree
zpe.sumelectzpe: -424.841200 hartree
zpe.sumelectthermal: -424.829921 hartree
zpe.sumelectthermalent: -424.828977 hartree
zpe.sumelectthermalfe: -424.878872 hartree
dipole: 1.6288 1.2579 -1.3931
dipole: 2.4851
quadrupole: -58.1502 -54.1450 -59.9360
quadrupole: -1.0251 4.8300 2.8374
quadrupole: -0.7398 3.2654 -2.5256 -1.0251 4.8300 2.8374
hfenergy: -425.0399545 hartree
pointgroup: C01 [X(C7H14O2)]
dipole: 0.6773115 -0.6025547 0.3662469 debye
dipolederiv: -0.9856558 0.5759521 -0.0687452 0.57218 -0.9560138 0.0121623 -0.0278119 -0.0487619 -0.4647239 -0.5867753 0.2307504 -0.0740344 0.2067618 -0.5125352 0.0060726 -0.418799 0.3471857 -0.7052371 0.1855097 -0.0096256 -0.0082468 0.0271229 0.1340241 0.0038782 -0.0278909 -0.001485 0.1534015 0.0098992 -0.009232 -0.0105778 -0.0228028 0.0128119 -0.0193102 -0.0137081 -0.0024993 0.0585448 0.5185362 -0.1478754 -0.030753 -0.1334508 0.5464744 0.1341313 -0.2213995 0.2671046 0.2637093 0.047477 -0.0214342 0.0449265 -0.0517412 0.0354758 -0.0041475 0.0501041 0.0093586 -0.085415 0.0657749 0.0162921 0.0171761 -0.0069857 -0.0621194 -0.0409494 0.0499262 -0.0496419 0.0153389 -0.1159168 -0.0650197 -0.0231499 -0.0414093 -0.0698475 -0.0541682 0.0460325 -0.0795805 0.0618526 0.9749178 -0.7600031 0.1716862 -0.7805615 0.8999227 -0.0473739 0.4875462 -0.3743667 0.936819 -0.1640753 0.0672868 -0.0899203 0.058095 -0.0063533 0.039422 -0.0855157 0.0379279 -0.0258691 0.0273903 -0.0296872 0.044313 -0.032798 0.0874333 0.0287759 0.0139245 0.0660088 -0.1338412 0.0103979 0.0459807 0.0100116 0.0345715 -0.1462031 -0.0774817 0.0225513 -0.1239349 0.0473063 0.0718803 0.0120192 -0.0057168 -0.0023663 -0.0422611 0.0802861 0.065293 0.0107553 -0.0460969 -0.0798666 0.0775284 -0.126312 0.0839996 0.0604105 0.0413572 -0.0798657 0.01838 0.0138444 0.0866061 0.0414226 0.0228466 0.0774315 -0.1406969 -0.1215885 0.0183085 -0.0739636 0.0168326 -0.0880052 -0.1251902 0.0684321 -0.1472187 -0.0067454 0.0567912 0.0352405 0.025733 0.0602204 0.0925181 0.0167128 0.0705886 0.0194192 0.0679112 0.0129036 0.0574466 -0.031774 -0.1633132 -0.1078391 -0.1537802 0.0155516 -0.1239398 -0.0453117 0.0048912 0.0476748 0.0295007 0.0924503 -0.062893 0.101924 -0.0804447 0.0808215 0.0355768 0.0153367 -0.1220902 0.0474768 0.0124819 0.0925977 -0.0058429 -0.0248765 -0.0382782 0.0206289 0.0680727 0.0127142 0.1311854 -0.072893 -0.1225542 0.0008704 -0.0500647 0.0552266 0.0732488 0.025574 -0.0600313 0.0137473 0.0878455 0.0653053 0.0541079 0.0869964 0.058116 -0.0124636 -0.0872274 0.0757191 -0.1059616 -0.0198489 0.0647709 0.0868431 0.0403134 0.1078066 0.0266326 -0.0774083 0.0746308 -0.1123945 -0.1034091 unknown
polarizability: 86.5037072|-4.9290953|81.7544466|-0.6350101|2.6065726|75.5473787 unknown
InChI: InChI=1S/C7H14O2/c1-6(2)4-7(3)9-5-8/h5-7H,4H2,1-3H3
charge 0 multiplicity 1
23 atoms
O  -1.093312 0.134737 1.060432
O  -2.423256 1.267064 -0.509657
C  2.070118 -0.019842 0.138648
C  0.959493 -1.0562 0.477039
C  -0.459754 -0.725361 -0.019751
C  2.361672 0.034369 -1.381746
C  1.775171 1.393711 0.695712
C  -1.353289 -1.957965 -0.215425
C  -2.042683 1.056486 0.661471
H  2.991236 -0.388969 0.63801
H  0.904203 -1.204878 1.573158
H  1.25033 -2.032298 0.038996
H  -0.449599 -0.117803 -0.943047
H  1.491015 0.414465 -1.949584
H  2.617634 -0.965884 -1.779387
H  3.209852 0.711391 -1.592954
H  1.549857 1.363082 1.776964
H  2.645113 2.058923 0.540471
H  0.909068 1.85389 0.185379
H  -1.404122 -2.556347 0.711711
H  -2.375764 -1.662822 -0.506475
H  -0.93963 -2.59584 -1.017606
H  -2.411155 1.589193 1.559441
