program: Gaussian 09
title: 000219358
version: EM64L-G09RevD.01
frameworkgroup: C1[X(C8H12O6)]
method: RPBEPBE
basis: SDD
operation: Freq
keyword: #pfreq=noraman
keyword: PBEPBE/SDD
title: #p freq=noraman PBEPBE/SDD
converged: YES YES NO NO
title: Mulliken charges:
elementType: O O O O O O C C C C C C C C H H H H H H H H H H H H
charge: -0.233791 -0.233777 -0.241989 -0.241986 -0.275473 -0.275489 -0.386269 -0.386268 -0.141638 -0.141753 0.335252 0.335279 -0.504569 -0.504576 0.238588 0.233534 0.238577 0.233520 0.253679 0.253634 0.242699 0.241472 0.238588 0.242710 0.241463 0.238586
chargesum: 0.00000
title: Mulliken charges with hydrogens summed into heavy atoms:
elementType: O O O O O O C C C C C C C C
charge: -0.233791 -0.233777 -0.241989 -0.241986 -0.275473 -0.275489 0.085854 0.085828 0.112040 0.111881 0.335252 0.335279 0.218189 0.218183
polarizability: 1.13689645e+02 -1.09588680e-02 1.20516924e+02 1.16470799e+01 -1.31487009e-03 8.70273807e+01
1716.lowfreq: -0.0007 -0.0004 -0.0001 2.0161 7.0984 7.3784 18.8237 24.8850 43.0419
frequency: 18.6436 23.8506 42.9928 57.9259 65.1612 94.3653 95.6276 123.7506 128.1879 170.4638 184.4058 187.3081 222.6732 253.0731 309.3439 332.2493 333.6629 389.7999 501.8498 506.5213 552.0664 622.6000 623.3755 697.9215 699.2123 797.8124 822.1847 843.5679 890.5844 894.1799 931.4084 988.0716 989.0237 1035.5196 1038.2088 1096.6826 1118.0141 1118.0402 1143.5525 1153.7811 1155.8173 1177.3728 1201.1205 1220.3476 1249.3251 1295.9571 1296.4790 1349.6978 1366.3755 1427.8904 1427.9550 1452.7124 1453.4648 1454.0149 1454.0698 1464.0372 1464.3336 1631.0589 1631.6426 1689.9419 3004.9654 3005.0924 3029.6638 3030.4416 3099.7563 3099.9214 3106.9794 3107.0201 3120.2366 3127.3631 3152.3573 3152.3735
redmass: 5.4512 4.5692 4.8603 5.5935 4.6123 1.3167 1.2678 2.3135 3.1456 3.0576 5.3921 4.7546 3.1422 3.2548 4.4826 3.3400 5.6099 3.2722 3.3527 3.8876 3.5203 6.4155 6.3639 11.8117 12.0859 2.6051 5.4658 3.6728 4.3713 8.0434 1.9744 1.1879 1.8092 6.3915 7.6727 4.3304 1.2551 1.2559 2.3344 1.5267 1.5923 5.3076 6.6690 1.1862 1.1243 1.2794 1.1954 1.2325 1.2906 1.1862 1.1862 1.1063 1.1035 1.0521 1.0499 1.0520 1.0527 8.6778 8.6195 6.3526 1.0299 1.0299 1.0571 1.0575 1.1053 1.1053 1.1049 1.1050 1.0994 1.0892 1.1044 1.1044
irintensity: 0.0057 0.0205 2.1121 0.8310 0.1040 0.1211 2.4688 8.2735 0.4943 9.6639 0.0234 6.4388 0.4686 16.2314 21.1648 6.2661 24.2454 14.8509 2.0934 2.1047 7.5856 1.2380 1.5083 40.0308 4.9020 34.4124 1.2859 14.2837 30.4898 118.6086 3.2758 94.9831 4.1745 14.8974 8.3568 65.9104 0.0045 0.0270 2.6009 13.7658 52.7278 251.4215 1126.6974 4.5045 16.6716 0.4260 2.6828 16.1280 3.7228 34.2547 23.3815 41.1734 28.1284 22.9261 0.8691 4.6375 14.6575 383.7438 2.3923 0.0811 8.1801 59.5450 15.7436 42.8049 2.1716 6.3383 53.4991 3.0297 0.9588 20.6587 8.0062 23.3465
temp: 298.150 k
press: 1.00000 atm
elementType: 8 8 8 8 8 8 6 6 6 6 6 6 6 6 1 1 1 1 1 1 1 1 1 1 1 1
symmnumber: 1
zpe: 520360.3 jmol-1
zpe.correction: 0.198195 hartree
zpe.thermalcorrener: 0.214389 hartree
zpe.thermalcorrenthalpy: 0.215333 hartree
zpe.thermalcorrgfe: 0.150983 hartree
zpe.sumelectzpe: -762.251423 hartree
zpe.sumelectthermal: -762.235228 hartree
zpe.sumelectthermalent: -762.234284 hartree
zpe.sumelectthermalfe: -762.298634 hartree
dipole: -0.0006 0.3791 -0.0003
dipole: 0.3791
quadrupole: -81.3646 -57.9594 -89.4479
quadrupole: -0.0076 -6.6823 -0.0029
quadrupole: -5.1073 18.2979 -13.1906 -0.0076 -6.6823 -0.0029
hfenergy: -762.4496175 hartree
pointgroup: C01 [X(C8H12O6)]
dipole: -0.0000804 0.14914 -0.0005909 debye
dipolederiv: -0.5740319 0.1089991 -0.055314 0.6202033 -1.4270643 -0.1980308 0.1221199 -0.3383764 -0.4279213 -0.5752546 -0.1103936 -0.0543941 -0.6205895 -1.4223254 0.204473 0.1265311 0.3445236 -0.431357 -0.5513298 0.4503957 -0.1232683 0.5453966 -1.3313595 0.1279844 -0.2194251 0.3259349 -0.4592528 -0.5528569 -0.4522823 -0.1205249 -0.5480104 -1.3327352 -0.1220515 -0.2163936 -0.3198694 -0.4562361 -0.4622124 0.0679543 -0.2102955 0.1511005 -0.6508854 -0.0721685 -0.1751876 -0.0543264 -0.8179779 -0.4626841 -0.0695621 -0.2098743 -0.1524879 -0.6497358 0.0714292 -0.1742684 0.0534427 -0.818569 0.6705749 -0.2231304 0.042821 -0.35079 0.7473255 0.0069721 -0.0149834 -0.1790477 0.1970494 0.6717914 0.2234394 0.0414132 0.3505651 0.7474796 -0.010596 -0.0170996 0.1755722 0.1959849 -0.0920566 -0.0307224 -0.0256662 -0.0645019 -0.2966973 -0.0280932 0.0072536 0.0994224 0.1036027 -0.0923784 0.0302225 -0.025886 0.0644777 -0.2974242 0.0305314 0.0066498 -0.0971531 0.1041226 0.6843181 -0.4130396 0.4017732 -0.8492332 2.1074854 0.0851758 0.2692657 0.0880851 1.169044 0.6863707 0.4175831 0.3991592 0.8530209 2.1043007 -0.0918521 0.2638754 -0.0944471 1.1697532 0.2958097 -0.0549471 -0.0277248 -0.1718001 0.7029295 0.0167246 -0.0917505 0.1347127 0.2350221 0.2960674 0.0552796 -0.0281637 0.1718324 0.7015653 -0.0197399 -0.0930837 -0.1375758 0.2360725 0.0428719 0.0645851 -0.0136149 0.0359255 0.0558831 -0.0216552 0.0419785 0.0839229 -0.0764969 -0.0622979 -0.0546928 -0.044375 0.0003388 -0.0607164 -0.0310082 -0.0632974 -0.0769508 0.0795846 0.0426884 -0.0646587 -0.0131847 -0.0356568 0.0556162 0.0208657 0.0420821 -0.0848427 -0.07612 -0.0621453 0.0544514 -0.0446541 -0.0006739 -0.0600961 0.0319782 -0.0631593 0.0779748 0.0788812 0.0330295 0.0058518 0.0506401 -0.0341328 0.1710961 0.0079 0.0690752 0.0009154 -0.0532794 0.0330474 -0.0052947 0.0506848 0.0347682 0.1710054 -0.0092879 0.0688877 -0.0022816 -0.0532943 -0.0902404 -0.0976601 -0.0169552 -0.0036409 -0.0104334 -0.013998 -0.0015137 -0.0769392 0.0892944 0.0383727 -0.0021494 0.08759 -0.0027615 0.0024814 0.029537 0.1367142 -0.0745024 -0.0555093 0.0672272 0.0806608 -0.0653251 0.0734043 -0.0098841 0.0539547 -0.0800102 0.0937291 0.016896 -0.0900776 0.0976257 -0.0175846 0.0037011 -0.0099142 0.0146657 -0.0014587 0.0775838 0.0886917 0.0383309 0.0026529 0.0875726 0.0035681 0.0027428 -0.0300053 0.1368251 0.0739562 -0.0558025 0.0670656 -0.081168 -0.0648486 -0.0740235 -0.0106395 -0.0537051 -0.0796273 -0.0934632 0.0178172 unknown
polarizability: 113.1319876|0.0367205|120.5164978|12.2560171|-0.1214806|87.5854644 unknown
InChI: InChI=1S/C8H12O6/c1-11-7(9)13-5-3-4-6-14-8(10)12-2/h3-4H,5-6H2,1-2H3
charge 0 multiplicity 1
26 atoms
O  -2.696538 -0.945233 -0.637493
O  2.69541 -0.946083 0.643819
O  -3.242731 1.213187 -0.636453
O  3.244673 1.211529 0.628771
O  -2.080188 0.36706 1.221139
O  2.08021 0.355163 -1.222921
C  -1.962797 -2.112985 -0.043711
C  1.959701 -2.116501 0.05769
C  -0.510391 -2.082011 -0.441855
C  0.507376 -2.080534 0.455728
C  -2.610255 0.226211 0.095959
C  2.610558 0.220764 -0.097083
C  -3.271236 2.541102 0.021295
C  3.274798 2.535149 -0.037506
H  -2.08441 -2.101535 1.053195
H  -2.493569 -2.974161 -0.482405
H  2.081224 -2.112324 -1.039279
H  2.489129 -2.975657 0.501913
H  -0.299885 -2.062001 -1.519871
H  0.29695 -2.054087 1.53362
H  -2.244638 2.897878 0.208761
H  -3.819027 2.48496 0.977072
H  -3.791629 3.191225 -0.695171
H  2.248642 2.891893 -0.227433
H  3.822677 2.472217 -0.99281
H  3.795849 3.189271 0.674831
