program: Gaussian 09
title: 000219355
version: EM64L-G09RevD.01
frameworkgroup: C1[X(C11H15BrO4)]
method: RPBEPBE
basis: SDD
operation: Freq
keyword: #p
keyword: freq=noraman
keyword: PBEPBE/SDD
title: #p freq=noraman PBEPBE/SDD
converged: NO YES NO NO
title: Mulliken charges:
elementType: Br O O O O C C C C C C C C C C C H H H H H H H H H H H H H H H
charge: -0.037261 -0.273906 -0.288234 -0.224987 -0.223608 -0.158446 -0.187867 -0.547433 -0.178154 -0.183907 -0.544334 -0.443929 0.200326 0.202096 -0.507933 -0.503412 0.293355 0.261126 0.295741 0.235048 0.287321 0.266810 0.317147 0.249270 0.254037 0.237125 0.245494 0.237530 0.234899 0.244086 0.241999
chargesum: 0.00000
title: Mulliken charges with hydrogens summed into heavy atoms:
elementType: Br O O O O C C C C C C C C C C C
charge: -0.037261 -0.273906 -0.288234 -0.224987 -0.223608 0.134909 0.073258 -0.016644 0.109168 0.082903 -0.227187 0.059378 0.200326 0.202096 0.212216 0.217572
polarizability: 1.63967259e+02 2.49204601e+00 1.27581597e+02 -4.09985974e+00 -5.30444478e+00 1.23993647e+02
1716.lowfreq: -7.3107 -0.0004 0.0002 0.0003 7.6816 16.0897 33.7005 46.7956 65.8418
frequency: 33.1153 46.7873 65.8304 73.8082 79.0192 102.9361 116.9681 119.4719 135.1327 156.7477 207.9045 242.0036 252.1551 265.7819 286.8690 296.9963 340.4266 357.8027 418.6017 452.6095 584.4483 592.1082 633.3945 663.6085 687.1648 742.6293 758.1725 769.2472 801.3743 853.2770 869.3058 878.6402 906.8815 932.1130 943.0149 949.2062 967.4481 987.5889 1008.0914 1022.7871 1035.3175 1081.6492 1104.4544 1110.6661 1114.2048 1119.4051 1145.6843 1149.3607 1155.4716 1166.8646 1176.5971 1189.2165 1208.7545 1225.6630 1256.8613 1262.3408 1274.3973 1287.2218 1292.4427 1306.3670 1328.8337 1340.7587 1419.1958 1421.1956 1451.6435 1453.1655 1461.4397 1467.3957 1468.4733 1483.8571 1638.9372 1642.6727 3002.9857 3003.8205 3017.2247 3018.7156 3027.8765 3066.9888 3077.3404 3078.4805 3091.5393 3103.5612 3105.6169 3112.5475 3117.1712 3148.0798 3149.9950
redmass: 6.0494 6.7115 4.6275 4.8213 6.5651 1.6530 1.4276 1.2686 4.4106 4.6696 5.1932 4.0799 5.2755 4.3616 4.3003 4.0251 3.4799 7.7156 3.8222 2.4783 4.0609 5.5888 3.4855 5.8090 6.8612 5.3466 5.2415 5.2276 5.3839 3.7505 2.7747 2.7909 3.8168 3.4692 1.9620 2.5456 1.9632 4.5550 2.9919 2.4870 1.8679 1.4183 1.4016 1.2700 1.2663 1.5855 1.4611 1.4497 1.7192 1.7699 1.6682 1.8427 1.8397 1.4485 1.4712 1.3805 1.5539 1.5106 1.3152 1.4819 1.4387 1.6433 1.1833 1.1827 1.0508 1.0505 1.0510 1.0745 1.0556 1.0918 9.4260 9.8190 1.0295 1.0295 1.0625 1.0823 1.0637 1.0859 1.0897 1.0940 1.0962 1.1043 1.1044 1.0919 1.1016 1.1050 1.1048
irintensity: 0.4140 1.8082 0.9126 0.4676 0.2261 2.4008 0.3961 0.7238 2.4414 3.5985 0.4812 7.7909 13.6748 10.4900 1.9753 6.8487 0.6914 16.6101 5.7175 1.0900 14.9590 1.0988 11.3142 13.5929 8.8374 14.3409 3.2284 10.5710 3.1240 24.2900 9.0335 8.9032 1.1072 3.7759 2.0452 2.6550 22.0794 61.1337 9.3830 48.5592 11.9655 7.1900 75.8919 2.0132 0.2629 16.5352 21.1870 20.8808 60.4217 24.0024 64.5386 112.0470 46.0765 54.6223 34.8017 3.3501 22.3859 3.2298 8.6236 16.7721 2.3176 25.0360 12.1029 28.3584 4.4286 18.7438 15.3615 14.7925 8.6849 18.2287 65.5617 294.8101 15.8487 51.7321 22.7183 13.5575 29.7569 5.0576 30.4523 2.1780 20.4902 45.3032 8.5350 12.0331 5.8007 10.3353 13.9544
temp: 298.150 k
press: 1.00000 atm
elementType: 35 8 8 8 8 6 6 6 6 6 6 6 6 6 6 6 1 1 1 1 1 1 1 1 1 1 1 1 1 1 1
symmnumber: 1
zpe: 645767.7 jmol-1
zpe.correction: 0.245960 hartree
zpe.thermalcorrener: 0.262480 hartree
zpe.thermalcorrenthalpy: 0.263424 hartree
zpe.thermalcorrgfe: 0.199865 hartree
zpe.sumelectzpe: -741.287752 hartree
zpe.sumelectthermal: -741.271232 hartree
zpe.sumelectthermalent: -741.270287 hartree
zpe.sumelectthermalfe: -741.333846 hartree
dipole: -2.1664 -1.3118 1.5842
dipole: 2.9872
quadrupole: -96.3396 -97.6184 -112.3587
quadrupole: -8.0677 -1.0627 -9.5368
quadrupole: 5.7659 4.4872 -10.2531 -8.0677 -1.0627 -9.5368
hfenergy: -741.5337116 hartree
pointgroup: C01 [X(C11H15Br1O4)]
dipole: 0.6164689 -0.5718736 -0.8210903 debye
polarizability: 159.4251278|-8.1011318|128.0806017|-9.1499995|7.9351765|128.0367734 unknown
InChI: InChI=1S/C11H15BrO4/c1-15-10(13)8-5-3-6(7(12)4-5)9(8)11(14)16-2/h5-9H,3-4H2,1-2H3
charge 0 multiplicity 1
31 atoms
Br -3.584813 1.417139 1.330874
O  1.704363 1.537077 0.802167
O  1.729947 -1.129698 -0.692379
O  0.90363 2.020065 -1.329972
O  1.75005 -1.996379 1.46501
C  -1.58534 0.657858 -0.820612
C  -1.259911 -1.543242 -0.288267
C  -1.216745 -0.66128 -1.570334
C  -0.481557 0.719984 0.271686
C  -0.253948 -0.803774 0.671333
C  -2.934429 0.21973 -0.20002
C  -2.700987 -1.265083 0.238727
C  0.750192 1.472244 -0.216138
C  1.159936 -1.356104 0.566858
C  2.955842 2.255111 0.464619
C  3.101838 -1.658538 -0.881212
H  -1.642534 1.570105 -1.430235
H  -1.033168 -2.613511 -0.414537
H  -0.223593 -0.610269 -2.040494
H  -1.968061 -0.961727 -2.322221
H  -0.838455 1.262142 1.166708
H  -0.541513 -0.962154 1.723539
H  -3.756704 0.327935 -0.923421
H  -3.438325 -1.928061 -0.248513
H  -2.791478 -1.406259 1.328178
H  3.579715 2.170712 1.365138
H  2.736647 3.310017 0.22887
H  3.440962 1.783934 -0.407156
H  3.386472 -1.344627 -1.895235
H  3.102637 -2.757575 -0.788719
H  3.78023 -1.233373 -0.122341
