program: Gaussian 09
title: 000219341
version: EM64L-G09RevD.01
frameworkgroup: C1[X(C15H14N2S2)]
method: RPBEPBE
basis: SDD
operation: Freq
keyword: #p
keyword: freq=noraman
keyword: PBEPBE/SDD
title: #p freq=noraman PBEPBE/SDD
converged: YES YES NO NO
title: Mulliken charges:
elementType: S S N N C C C C C C C C C C C C C C C H H H H H H H H H H H H H H
charge: 0.310116 0.053453 -0.094646 -0.398275 -0.417025 0.660745 -0.437255 -0.400163 -0.555099 -0.342500 -0.273337 0.470363 -0.226390 -0.243542 -0.362654 -0.429638 -0.222891 -0.192745 -0.276958 0.265212 0.252407 0.227356 0.271362 0.293737 0.246094 0.249333 0.234208 0.236839 0.216782 0.216802 0.218842 0.222371 0.227096
chargesum: 0.00000
title: Mulliken charges with hydrogens summed into heavy atoms:
elementType: S S N N C C C C C C C C C C C C C C C
charge: 0.310116 0.053453 -0.094646 -0.104538 0.100594 0.660745 0.061464 -0.400163 -0.555099 -0.096407 -0.024004 0.470363 0.007819 -0.006703 -0.145872 -0.212836 -0.004049 0.029625 -0.049863
polarizability: 2.63806745e+02 3.38199704e+00 2.85006801e+02 -2.36616050e+01 2.73145929e+00 9.08381441e+01
1716.lowfreq: -8.0503 -4.5812 0.0009 0.0011 0.0019 6.2934 18.1464 31.2992 37.6047
frequency: 18.1235 31.2443 37.4983 61.1004 66.8923 93.7841 159.9611 183.2861 217.5842 244.7940 258.9659 302.0281 315.4101 349.5086 378.4671 397.5012 408.0126 414.4161 428.4835 461.9869 493.0256 506.6418 514.5025 551.3478 570.2953 610.8871 618.8915 633.0357 683.6047 691.4332 723.8216 753.9061 754.8439 762.7328 790.2058 812.6942 836.2238 849.6505 869.8164 920.0830 933.5017 954.5362 974.6914 976.9305 979.4673 1008.3750 1021.8177 1026.4790 1030.6149 1072.9576 1080.9313 1117.5213 1127.7553 1140.5596 1170.0228 1177.8148 1188.2876 1204.8196 1266.5811 1288.0384 1291.7876 1296.9408 1319.9285 1336.2386 1358.7373 1376.7935 1386.3982 1398.8139 1433.3013 1445.8182 1456.9669 1468.0607 1482.9515 1486.4221 1511.3439 1588.0619 1590.8881 1597.5020 1624.0156 3000.4543 3029.0754 3064.7520 3098.1521 3110.4819 3121.5039 3137.5874 3140.3078 3145.6190 3151.4416 3162.2891 3167.1926 3175.6875 3571.4316
redmass: 5.1455 5.7512 4.1529 5.4979 5.7644 7.7882 5.0172 4.6516 6.3743 6.0172 2.6223 4.7745 2.7980 5.5669 14.7574 6.5158 2.8844 1.1856 3.1888 5.2248 7.3893 2.8709 5.6800 4.4579 4.6533 6.3285 6.1240 4.8026 5.5252 1.9139 3.0333 1.7052 1.5113 1.7172 3.6410 1.2656 2.7511 1.3764 1.5051 6.7601 1.3786 1.3635 1.3877 3.4044 1.4474 5.5117 2.3433 3.3230 3.2122 1.8000 2.1542 3.7500 2.3191 1.5929 1.0515 1.0979 1.1072 1.4754 1.6063 1.5663 2.9101 1.5839 1.4348 1.3569 2.1676 1.3297 3.5774 7.1725 2.2428 2.5028 2.8450 1.1077 1.5662 1.2596 2.2998 6.9540 4.9863 6.8957 6.2799 1.0622 1.0596 1.1011 1.1056 1.0873 1.0854 1.0916 1.0857 1.0945 1.0897 1.0952 1.1007 1.1006 1.0769
irintensity: 1.1596 0.5791 1.2319 0.2386 0.2418 0.6904 0.2604 1.7004 2.3926 3.6689 0.8311 0.7411 2.2762 5.5887 3.1855 2.4643 0.8538 122.1614 5.0683 17.2283 2.9860 11.4728 3.0927 12.6520 4.0468 2.3867 1.6537 4.9126 7.5196 44.6147 7.0834 11.5481 164.6623 13.7081 1.7744 1.9454 2.7547 2.3365 9.2179 50.4452 1.9926 0.3457 0.7415 3.8709 0.2605 8.4302 2.4218 16.4330 1.6412 3.2146 15.6978 39.1702 42.0381 48.7981 3.7128 2.1625 10.7157 102.9192 45.4489 44.4906 33.6914 29.9551 13.5854 31.3244 182.4787 31.2966 23.9610 6.6238 5.8299 6.4505 79.3214 24.8993 15.4106 11.1666 185.4984 0.7575 8.0379 16.0247 188.8755 18.2381 29.9988 3.0396 4.7113 13.4107 8.2136 15.5473 0.6962 57.3664 4.8213 12.7967 16.6817 16.5036 24.6901
temp: 298.150 k
press: 1.00000 atm
elementType: 16 16 7 7 6 6 6 6 6 6 6 6 6 6 6 6 6 6 6 1 1 1 1 1 1 1 1 1 1 1 1 1 1
symmnumber: 1
zpe: 670180.0 jmol-1
zpe.correction: 0.255258 hartree
zpe.thermalcorrener: 0.271942 hartree
zpe.thermalcorrenthalpy: 0.272887 hartree
zpe.thermalcorrgfe: 0.208284 hartree
zpe.sumelectzpe: -1484.296864 hartree
zpe.sumelectthermal: -1484.280180 hartree
zpe.sumelectthermalent: -1484.279236 hartree
zpe.sumelectthermalfe: -1484.343838 hartree
dipole: 1.0347 3.2478 0.0294
dipole: 3.4087
quadrupole: -125.8985 -120.4561 -133.1303
quadrupole: -17.2716 -4.5132 -0.4600
quadrupole: 0.5965 6.0389 -6.6353 -17.2716 -4.5132 -0.4600
hfenergy: -1484.5521223 hartree
pointgroup: C01 [X(C15H14N2S2)]
dipole: 0.2384865 1.2022636 0.5442635 debye
polarizability: 259.810135|14.5641342|252.9871996|-30.7246008|71.8467024|126.8543556 unknown
InChI: InChI=1S/C15H14N2S2/c18-15-17(13-8-4-5-9-14(13)19-15)11-10-16-12-6-2-1-3-7-12/h1-9,16H,10-11H2
charge 0 multiplicity 1
33 atoms
S  -4.064771 -1.492602 -0.402122
S  -1.942803 -3.307585 -1.792326
N  -1.549338 -0.76013 -0.77463
N  2.167307 -1.47948 -0.407384
C  -0.12029 -0.794818 -1.152419
C  -2.140234 0.338867 -0.103167
C  0.752721 -1.478896 -0.056154
C  -3.518236 0.136054 0.18515
C  -2.370946 -1.858032 -1.030075
C  -1.509926 1.548048 0.269497
C  -4.28194 1.116586 0.841141
C  3.034734 -0.388493 -0.25413
C  -2.276605 2.534434 0.927308
C  -3.64844 2.325676 1.213249
C  2.647642 0.807411 0.420248
C  4.362047 -0.474195 -0.772776
C  3.564496 1.871339 0.565937
C  5.263736 0.595719 -0.621474
C  4.875834 1.782571 0.047569
H  -0.038315 -1.374274 -2.088127
H  0.228682 0.23331 -1.343438
H  0.594758 -0.980305 0.91852
H  0.409417 -2.522616 0.05324
H  2.526053 -2.294243 -0.903643
H  -0.453224 1.728539 0.051129
H  -5.341527 0.951355 1.058605
H  -1.798782 3.475407 1.218992
H  -4.224805 3.103137 1.724629
H  1.646333 0.90249 0.854063
H  4.678632 -1.387345 -1.293438
H  3.247309 2.778203 1.094531
H  6.277001 0.503041 -1.029273
H  5.57918 2.613326 0.162668
