program: Gaussian 09
title: 000219330
version: EM64L-G09RevD.01
frameworkgroup: C1[X(C9H24N3PS)]
method: RPBEPBE
basis: SDD
operation: Freq
keyword: #p
keyword: freq=noraman
keyword: PBEPBE/SDD
title: #p freq=noraman PBEPBE/SDD
converged: YES YES NO NO
title: Mulliken charges:
elementType: S P N N N C C C C C C C C C H H H H H H H H H H H H H H H H H H H H H H H H
charge: -0.287770 0.807089 -0.638820 -0.680651 -0.666415 -0.278663 -0.279867 -0.310751 -0.357664 -0.351497 -0.325922 -0.677658 -0.677052 -0.675852 0.312679 0.315940 0.324340 0.204630 0.220154 0.222711 0.219865 0.245154 0.202177 0.216035 0.194181 0.191388 0.210535 0.184916 0.206101 0.210561 0.209406 0.222975 0.210756 0.214300 0.219838 0.219200 0.206397 0.217255
chargesum: 0.00000
title: Mulliken charges with hydrogens summed into heavy atoms:
elementType: S P N N N C C C C C C C C C
charge: -0.287770 0.807089 -0.326142 -0.364711 -0.342075 0.146122 0.162709 0.136579 0.052552 0.050426 0.065096 -0.034717 -0.032158 -0.033001
polarizability: 1.65079281e+02 -8.45306380e-01 1.69715668e+02 2.49685517e+00 -1.11797438e+01 1.53295890e+02
1716.lowfreq: -1.7080 -0.0004 0.0022 0.0028 9.9540 13.9255 20.6327 26.8491 37.6148
frequency: 19.8814 26.4951 37.3904 45.2161 55.8517 63.5307 75.7658 82.2167 86.9814 132.2687 144.7656 175.2943 190.6374 206.0073 214.7475 216.9272 220.7720 249.3697 266.2366 273.6145 290.3168 364.8241 377.5959 396.7299 403.3463 428.3228 495.5385 525.3873 570.9920 618.2726 727.3552 747.4925 749.8821 758.1715 805.8546 825.1685 878.6583 881.2856 885.9929 888.2053 899.3264 900.1922 1042.6398 1044.3978 1045.3147 1088.6072 1094.9585 1107.2599 1110.9581 1115.8526 1116.5935 1129.3863 1136.2422 1137.4099 1226.9940 1230.9774 1232.0272 1279.4871 1284.1605 1288.8417 1298.9593 1300.0718 1301.7320 1353.7869 1355.3339 1357.9703 1380.3828 1384.8069 1386.5350 1391.6182 1394.4363 1395.5753 1461.7678 1469.7831 1470.6754 1472.4753 1476.8092 1477.7273 1477.8558 1480.5111 1481.6912 1486.0234 1490.8574 1492.8032 2920.8683 2943.2602 2961.7150 2974.2741 2974.8405 2976.0567 2976.5794 2977.7905 2977.9546 3015.0793 3020.4605 3024.2095 3039.6452 3043.2397 3046.4493 3072.0700 3074.4350 3075.0100 3077.5046 3079.1077 3079.2333 3481.7593 3510.6904 3540.2128
redmass: 3.3592 3.2454 3.1463 2.9664 1.8459 2.0061 1.9795 2.6997 3.3197 3.1344 2.9450 3.9712 3.4456 2.4115 1.1445 1.1052 1.3269 3.0889 2.9037 4.1028 3.6371 3.3772 1.3937 2.7393 4.4177 4.0412 3.6279 1.7126 2.8584 1.6309 1.6989 1.0858 1.1176 1.6947 2.9055 2.2845 1.3071 1.6979 1.4745 1.5225 1.5026 1.4166 3.2180 3.3885 3.3670 3.4590 3.4877 2.3780 1.9591 2.3251 2.2317 1.8485 1.6051 1.5939 1.2813 1.2675 1.2794 1.1379 1.1537 1.1596 1.2514 1.2322 1.2482 1.3523 1.3982 1.3874 1.2618 1.2433 1.2320 1.2341 1.2325 1.2367 1.0645 1.0641 1.0640 1.0644 1.0428 1.0419 1.0425 1.0608 1.0611 1.0722 1.0827 1.0826 1.0681 1.0673 1.0612 1.0614 1.0499 1.0475 1.0403 1.0394 1.0573 1.0973 1.0897 1.0926 1.1034 1.1002 1.0995 1.1007 1.1012 1.1009 1.0996 1.0994 1.0991 1.0744 1.0756 1.0759
irintensity: 0.2788 0.0262 0.3762 0.4682 0.8409 0.2342 1.1540 1.3684 0.5921 2.3640 1.8803 0.7353 3.3192 1.9495 0.2358 0.1049 1.3035 0.0275 3.9634 1.1532 11.3329 31.1788 52.6174 36.9366 21.2545 1.1958 61.7278 84.6550 29.3442 152.3561 76.3505 10.7772 17.2756 31.6979 56.0879 97.2891 7.7127 10.3930 9.0901 16.8279 17.4396 19.6074 8.5810 15.2933 16.4434 103.6570 48.0288 32.1180 20.1071 24.4903 16.0480 36.5513 32.7630 34.6696 10.1047 15.8945 12.1123 4.9184 9.6414 17.2354 0.0341 0.9919 0.1241 1.1230 0.2979 1.6792 9.5634 11.3349 0.2065 25.8119 54.3943 22.0326 2.1278 1.5703 5.5457 6.2114 12.1182 13.3278 13.4543 2.0297 1.3314 14.0316 15.2825 17.3640 66.0825 42.8182 31.2060 26.7649 102.9589 9.4965 59.4027 37.2627 6.6076 4.4303 8.7517 6.0011 12.0205 12.5243 15.0470 61.4268 79.6561 76.2722 42.7870 47.6777 50.0663 12.7095 15.9315 10.4486
temp: 298.150 k
press: 1.00000 atm
elementType: 16 15 7 7 7 6 6 6 6 6 6 6 6 6 1 1 1 1 1 1 1 1 1 1 1 1 1 1 1 1 1 1 1 1 1 1 1 1
symmnumber: 1
zpe: 872183.1 jmol-1
zpe.correction: 0.332197 hartree
zpe.thermalcorrener: 0.352720 hartree
zpe.thermalcorrenthalpy: 0.353664 hartree
zpe.thermalcorrgfe: 0.279988 hartree
zpe.sumelectzpe: -1259.713776 hartree
zpe.sumelectthermal: -1259.693254 hartree
zpe.sumelectthermalent: -1259.692309 hartree
zpe.sumelectthermalfe: -1259.765986 hartree
dipole: 0.0996 2.5569 -4.1832
dipole: 4.9037
quadrupole: -96.2359 -102.4322 -112.6549
quadrupole: 0.2923 1.1674 7.5365
quadrupole: 7.5384 1.3421 -8.8806 0.2923 1.1674 7.5365
hfenergy: -1260.0459735 hartree
pointgroup: C01 [X(C9H24N3P1S1)]
dipole: 0.4646213 -0.2199101 1.8595251 debye
polarizability: 165.2620959|-0.0838097|159.755738|3.1150055|-13.6454414|163.0730055 unknown
InChI: InChI=1S/C9H24N3PS/c1-4-7-10-13(14,11-8-5-2)12-9-6-3/h10-12H,4-9H2,1-3H3
charge 0 multiplicity 1
38 atoms
S  -0.653375 0.172755 -3.025639
P  -0.250379 -0.197446 -1.005085
N  1.237722 -1.115749 -0.85287
N  -1.281088 -1.206863 -0.003735
N  -0.296084 1.247231 -0.041521
C  2.017468 -1.17177 0.403266
C  -2.73227 -0.916435 0.100425
C  -0.090332 2.608437 -0.559335
C  2.93995 -2.408981 0.423087
C  -3.347368 -1.644564 1.313023
C  1.311938 3.195021 -0.26767
C  3.790814 -2.47852 1.709538
C  -4.864428 -1.384222 1.434598
C  1.450507 4.637641 -0.800072
H  1.780603 -1.12865 -1.72313
H  -1.058818 -2.203955 -0.120382
H  -0.401448 1.11849 0.967553
H  2.628303 -0.252891 0.554381
H  1.302782 -1.229889 1.246225
H  -2.850752 0.176919 0.216171
H  -3.273617 -1.203112 -0.827688
H  -0.262566 2.570394 -1.652984
H  -0.868272 3.275593 -0.134383
H  2.31793 -3.317877 0.319308
H  3.607577 -2.379546 -0.462247
H  -3.165138 -2.734746 1.216868
H  -2.823575 -1.316498 2.231009
H  1.50023 3.175714 0.825092
H  2.074455 2.54164 -0.735146
H  4.43563 -1.585448 1.811747
H  3.149878 -2.536604 2.609322
H  4.445769 -3.368189 1.705011
H  -5.074981 -0.305453 1.559126
H  -5.401759 -1.728956 0.531455
H  -5.291246 -1.914046 2.305073
H  1.288566 4.672749 -1.89359
H  0.708822 5.310324 -0.328818
H  2.455748 5.0473 -0.593683
