program: Gaussian 09
title: 000219322
version: EM64L-G09RevD.01
frameworkgroup: C1[X(C8H7BrClNO)]
method: RPBEPBE
basis: SDD
operation: Freq
keyword: #p
keyword: freq=noraman
keyword: PBEPBE/SDD
title: #p freq=noraman PBEPBE/SDD
converged: YES YES NO NO
title: Mulliken charges:
elementType: Br Cl O N C C C C C C C C H H H H H H H
charge: -0.020389 -0.053612 -0.243600 -0.429392 0.500145 -0.424827 -0.327995 -0.183141 -0.198158 -0.119768 0.259380 -0.755656 0.233717 0.310776 0.311064 0.257705 0.257469 0.313165 0.313116
chargesum: 0.00000
title: Mulliken charges with hydrogens summed into heavy atoms:
elementType: Br Cl O N C C C C C C C C
charge: -0.020389 -0.053612 -0.243600 -0.118328 0.500145 -0.191110 -0.017219 0.074565 0.059310 -0.119768 0.259380 -0.129375
polarizability: 2.03254123e+02 2.28625282e+00 1.28122044e+02 -7.73801084e-03 -1.19626338e-03 4.76598102e+01
1716.lowfreq: -5.8757 -0.0023 -0.0021 -0.0019 1.7194 5.5184 32.2299 61.4096 71.9764
frequency: 32.0451 61.4005 71.9762 73.7785 143.0912 157.8664 253.1152 294.7232 335.1561 369.6652 377.3910 411.9447 500.5432 518.3135 564.7048 620.2389 641.3381 688.4982 706.2182 721.4221 820.4886 840.1160 847.1276 868.7033 941.0402 942.9339 981.5682 995.1966 1074.9152 1117.8273 1142.8087 1187.0065 1205.5036 1232.7591 1263.2769 1299.1536 1373.9680 1402.5113 1413.6633 1480.4059 1525.2279 1597.8194 1602.5210 1607.7256 3067.8540 3127.7572 3150.0692 3166.4682 3174.0771 3194.9972 3455.0100
redmass: 5.0392 4.7437 16.0169 4.0293 13.0065 5.5025 9.0804 12.5343 5.2312 5.9907 9.8681 2.9949 2.7719 6.5169 2.9739 6.8196 5.9268 6.6636 3.0609 1.2174 1.3678 5.5963 1.4270 1.7151 6.6117 1.3641 1.3218 4.1998 2.6440 1.3265 1.1284 1.1161 3.1686 1.2808 1.9714 1.3657 5.6992 3.6153 1.1316 2.4407 2.3178 5.3817 5.8704 6.5586 1.0565 1.0905 1.1088 1.0912 1.0954 1.0957 1.0767
irintensity: 3.5989 0.1139 0.3565 13.1974 5.1886 0.0007 1.3956 2.2275 0.0755 3.3665 34.9285 0.0069 30.6122 4.2259 4.2197 15.0501 80.6906 31.6019 9.1717 31.2669 39.9481 4.9523 68.5795 20.6953 0.4995 2.0771 3.0045 29.2196 41.2803 21.0349 0.0357 1.1872 4.8592 36.8424 5.7137 6.9739 64.2264 34.0860 15.8517 109.5511 503.0797 88.7869 179.7402 14.3028 2.0801 11.0345 0.0016 2.2546 1.8651 5.3182 91.5476
temp: 298.150 k
press: 1.00000 atm
elementType: 35 17 8 7 6 6 6 6 6 6 6 6 1 1 1 1 1 1 1
symmnumber: 1
zpe: 350768.6 jmol-1
zpe.correction: 0.133601 hartree
zpe.thermalcorrener: 0.145093 hartree
zpe.thermalcorrenthalpy: 0.146037 hartree
zpe.thermalcorrgfe: 0.093035 hartree
zpe.sumelectzpe: -911.695991 hartree
zpe.sumelectthermal: -911.684498 hartree
zpe.sumelectthermalent: -911.683554 hartree
zpe.sumelectthermalfe: -911.736556 hartree
dipole: 1.7458 -1.6045 0.0070
dipole: 2.3712
quadrupole: -94.3929 -85.5807 -88.6735
quadrupole: 1.0396 0.0268 -0.0035
quadrupole: -4.8439 3.9683 0.8755 1.0396 0.0268 -0.0035
hfenergy: -911.8295913 hartree
pointgroup: C01 [X(C8H7Br1Cl1N1O1)]
dipole: -0.5332063 -0.7645277 0.0382863 debye
dipolederiv: -0.3835334 -0.1204804 -0.009842 -0.4188857 -0.5544795 0.0138218 0.0255898 0.0409048 -0.119237 -0.9455912 -0.0857399 -0.0678525 -0.092333 -0.1306882 -0.0007678 -0.0668719 -0.0001614 -0.0720388 -0.7948036 -0.2918962 -0.0062758 0.5437092 -0.9464351 0.1179774 -0.1038932 0.0426542 -0.3589417 -1.7392356 0.1353778 -0.1461279 0.3908796 -0.445423 0.054543 -0.1765916 0.0316619 -0.2966728 1.1599737 0.058333 0.0883696 0.2015562 0.0019051 0.0288519 0.0726476 0.0160281 0.1001819 -0.1576505 -0.0038442 0.0029406 0.0862211 0.0471998 -0.0192541 -0.0075245 -0.0273728 -0.1856385 -0.1759901 -0.0139188 -0.0007272 -0.1046853 -0.0535783 -0.0205929 0.0094629 -0.0125285 -0.1493536 -0.2434013 -0.0461355 -0.0077473 -0.1426322 0.0284671 -0.0267646 0.0034119 -0.0182354 -0.0920506 -0.2750045 0.0037752 -0.0161429 0.0819212 0.0754473 -0.0122562 -0.024816 -0.0192054 -0.0960339 1.2550535 0.1398781 0.1017517 0.1445019 0.0624072 -0.0038337 0.1009151 -0.0042432 -0.0727229 1.6137709 0.1689997 0.1076673 -1.2522285 0.9178695 -0.1951203 0.2739274 -0.0675439 0.2241355 -0.0554543 0.0551457 -0.0181923 0.5458283 0.8377418 -0.0414881 -0.0766562 -0.085535 0.0755848 0.0171497 -0.1014027 -0.0018842 -0.0890666 -0.0401033 0.0161249 -0.0033692 0.015047 0.1676085 0.1532507 0.0678841 -0.0103128 0.0295897 0.0909548 0.0130652 -0.0059871 0.0165805 0.1801676 0.3785595 0.1007097 -0.0035664 0.120871 0.174689 0.0233823 -0.0058866 0.0214991 0.2815753 0.0381003 0.06552 -0.0188669 0.0667536 0.0168425 0.0230568 -0.0189312 0.0229825 0.161879 0.0610118 -0.0540614 -0.0027517 -0.0604921 -0.0082172 0.0140318 -0.0019282 0.0146225 0.1598005 0.0376643 -0.0343308 0.0327975 -0.0115441 -0.0460642 -0.0501005 0.0765189 -0.0071946 0.0641485 0.0561301 -0.0438134 -0.0232371 -0.0399643 -0.0285352 0.0653233 -0.070018 0.0200394 0.027608 unknown
polarizability: 199.5737667|15.0570152|129.8123002|11.7582282|-8.1680387|49.6499105 unknown
InChI: InChI=1S/C8H7BrClNO/c9-5-8(12)11-7-3-1-6(10)2-4-7/h1-4,11H,5H2
charge 0 multiplicity 1
19 atoms
Br -3.997679 -2.14173 -0.25024
Cl 4.722656 0.260933 0.245326
O  -2.134258 1.642492 -0.523421
N  -1.266733 -0.52635 -0.195346
C  0.134524 -0.283745 -0.097771
C  0.976832 -1.409013 0.106008
C  0.701967 1.014765 -0.195852
C  2.37237 -1.24914 0.211334
C  2.100272 1.174079 -0.090122
C  2.917612 0.046029 0.111121
C  -2.276494 0.3875 -0.391561
C  -3.717343 -0.13226 -0.462621
H  0.545816 -2.414703 0.183064
H  0.054322 1.87914 -0.352233
H  -1.567875 -1.504396 -0.109889
H  3.020801 -2.115446 0.368148
H  2.543688 2.17122 -0.16477
H  -4.311763 0.33123 0.338767
H  -4.147416 0.119995 -1.443341
