program: Gaussian 09
title: 000219312
version: EM64L-G09RevD.01
frameworkgroup: C1[X(C11H9NO2)]
method: RPBEPBE
basis: SDD
operation: Freq
keyword: #p
keyword: freq=noraman
keyword: PBEPBE/SDD
title: #p freq=noraman PBEPBE/SDD
converged: YES YES NO NO
title: Mulliken charges:
elementType: O O N C C C C C C C C C C C H H H H H H H H H
charge: -0.260668 -0.203895 -0.011478 0.357995 -0.067074 0.253844 -0.528657 0.318607 -0.300664 -0.345579 -0.277900 -0.371543 -0.194884 -0.536025 0.251041 0.264461 0.251122 0.269213 0.246310 0.182337 0.251497 0.225989 0.225951
chargesum: 0.00000
title: Mulliken charges with hydrogens summed into heavy atoms:
elementType: O O N C C C C C C C C C C C
charge: -0.260668 -0.203895 -0.011478 0.357995 -0.067074 0.253844 -0.277617 0.318607 -0.036203 -0.094457 -0.008687 -0.125233 -0.012547 0.167412
polarizability: 2.25269253e+02 -8.42363631e-01 1.46421458e+02 2.87886765e-02 9.51849888e-03 5.63054158e+01
1716.lowfreq: -7.0937 -4.8132 -0.0005 0.0008 0.0008 6.6238 71.8228 82.6058 115.7088
frequency: 71.8092 82.6045 115.7077 150.9966 178.9934 193.8965 235.6454 237.1744 317.9010 327.4132 362.1800 426.1792 447.6092 508.4806 519.9855 548.6455 549.8577 642.8522 665.3001 695.3914 760.5611 784.0001 829.9571 841.2432 869.8810 878.0062 882.8220 964.5268 971.4850 993.9549 999.4170 1007.3409 1076.5845 1110.9488 1135.0699 1159.1117 1185.9253 1231.1135 1253.6488 1263.6158 1313.7532 1360.2368 1372.5713 1398.9970 1429.8423 1436.6861 1458.8264 1471.2416 1472.4700 1504.3713 1541.7946 1557.7444 1606.9020 1630.0214 2927.7867 2968.3271 3060.1067 3132.0995 3134.1318 3155.8765 3161.7844 3169.0363 3177.2467
redmass: 3.2970 5.1412 3.1267 5.9838 3.4732 2.9058 3.8347 1.3260 3.8553 6.2553 7.0270 3.1354 6.2845 6.4456 3.0756 5.0568 4.7092 7.3215 3.2044 5.8705 5.7436 2.1977 1.8128 5.7885 1.3272 5.9041 1.7392 1.6305 1.3458 1.6145 6.0914 2.7513 2.2397 1.2563 1.3558 1.3214 2.0858 2.2190 1.9065 2.8638 3.5829 2.3300 2.5939 1.6243 2.0869 1.6264 2.5325 1.0498 1.0856 3.5828 6.7404 7.9026 6.7120 6.8628 1.0849 1.0327 1.1045 1.0999 1.0892 1.0874 1.0956 1.0911 1.0974
irintensity: 1.6095 0.1500 18.0330 0.0480 1.3921 3.8758 10.1277 0.6442 5.2505 6.4980 0.1386 9.1467 3.5676 11.1161 1.8000 1.0158 14.8290 14.9108 3.7275 9.2010 15.1484 4.6507 22.6508 1.3625 29.9575 12.6909 45.1997 2.3481 1.8879 3.1970 49.4087 32.1077 13.4958 0.1466 8.7337 28.9806 162.4078 25.6810 120.1385 87.8305 62.6589 2.6856 0.6161 16.6875 14.6447 11.8237 36.5446 14.6612 39.1149 109.7936 31.2548 139.2080 112.4948 129.3636 67.9969 78.3763 42.8614 21.9602 14.8499 2.9319 8.5624 4.2477 10.2692
temp: 298.150 k
press: 1.00000 atm
elementType: 8 8 7 6 6 6 6 6 6 6 6 6 6 6 1 1 1 1 1 1 1 1 1
symmnumber: 1
zpe: 454100.6 jmol-1
zpe.correction: 0.172958 hartree
zpe.thermalcorrener: 0.184661 hartree
zpe.thermalcorrenthalpy: 0.185605 hartree
zpe.thermalcorrgfe: 0.135017 hartree
zpe.sumelectzpe: -628.763855 hartree
zpe.sumelectthermal: -628.752152 hartree
zpe.sumelectthermalent: -628.751208 hartree
zpe.sumelectthermalfe: -628.801796 hartree
dipole: -5.0483 1.1095 0.0014
dipole: 5.1688
quadrupole: -68.3155 -88.8411 -83.3780
quadrupole: 6.3211 -0.0160 0.0017
quadrupole: 11.8627 -8.6629 -3.1998 6.3211 -0.0160 0.0017
hfenergy: -628.936813 hartree
pointgroup: C01 [X(C11H9N1O2)]
dipole: -1.9833249 0.4461821 0.0514538 debye
dipolederiv: -1.8341811 -0.3071835 0.0100825 -0.8794198 -0.4564199 0.0064111 -0.0154813 -0.0026689 -0.2952676 -0.9371345 0.5532348 0.0344783 0.3654095 -0.7492827 -0.0250653 0.0254939 -0.027538 -0.3242362 0.2412683 -0.1341442 -0.0133057 0.1572978 -0.3151433 -0.006174 0.0000127 -0.0017679 -0.2321449 0.3869729 -0.047828 -0.0072496 0.5442032 -0.099038 -0.0154802 0.0198087 -0.0066463 0.0577312 -0.1441937 0.1212346 0.0083437 -0.4502866 -0.0845248 0.0013052 -0.0178646 -0.0073683 0.0369564 0.0384763 -0.104858 -0.0054491 0.4456622 -0.6971718 -0.0386378 0.0197581 -0.0305189 -0.003081 -0.7189711 -0.1292577 0.0023346 -0.0589847 0.0574527 0.0121111 0.005857 0.0131275 -0.1895744 1.3319707 0.4673351 0.0023669 1.1138835 0.4758172 -0.0010472 0.0317276 0.0092097 0.1141924 0.300464 -0.1015807 -0.0110585 0.0088691 0.1553232 0.0122546 -0.0059368 0.0139359 -0.1165146 -0.1735071 -0.0688796 -0.0032496 -0.5523163 -0.155171 0.0100766 -0.0253726 0.0025884 -0.1873712 -0.1318143 0.0893034 0.0055178 -0.4923175 0.0344817 0.0109493 -0.0210776 0.0022747 -0.0416218 -0.1690276 0.2288815 0.0118141 0.5319521 0.1795423 0.0040714 0.0256255 0.0086412 -0.0851681 0.9196344 -0.3405933 -0.0273525 -0.6459064 1.3755864 0.0680907 -0.0412587 0.0632724 0.1096752 1.0457187 0.056576 -0.0086891 -0.2360637 0.1954632 -0.0019637 -0.0226619 -0.0066731 0.319736 0.0975283 0.0318703 0.0024838 -0.0190151 -0.0419839 -0.0091142 0.0001991 -0.0097529 0.1654177 0.0913307 -0.0097166 0.0005124 0.0397285 -0.0371392 -0.0092965 0.0027961 -0.0085372 0.1535494 -0.0778297 0.0658971 0.0066598 0.0554255 0.0866354 -0.004405 0.0061476 -0.0045958 0.16399 0.0003276 0.0138504 0.0028511 0.0588987 0.1133012 -0.0025042 0.0048854 -0.0018373 0.1484691 -0.0553404 -0.0961449 -0.0015358 -0.0987552 0.0014953 -0.0046271 -0.0016836 -0.0046537 0.1349512 -0.0957963 -0.1875844 -0.0058122 -0.0783841 -0.0565618 -0.0064167 -0.0006738 -0.0047368 0.1063713 -0.0389452 -0.0825641 -0.0009338 -0.1495069 -0.0321288 -0.0044212 -0.0038778 -0.0055327 0.1262292 -0.0397669 -0.0073467 0.0008593 0.1747187 0.0152187 0.1204872 -0.0564228 0.100813 -0.0706286 -0.0371843 -0.0105015 -0.0036684 0.1649078 0.0342478 -0.1166039 0.0699999 -0.0910349 -0.0916607 unknown
polarizability: 225.2175689|-1.1831508|146.2446974|-2.6294666|4.1249644|56.5338614 unknown
InChI: InChI=1S/C11H9NO2/c1-14-9-2-3-11-10(6-9)8(7-13)4-5-12-11/h2-7H,1H3
charge 0 multiplicity 1
23 atoms
O  -3.132949 -1.26947 -0.042031
O  3.249319 -2.474737 -0.194088
N  1.251052 2.245701 0.051201
C  0.368626 -0.095667 -0.042779
C  0.193269 1.35004 0.026173
C  1.73369 -0.583129 -0.085578
C  -0.789925 -0.923808 -0.06287
C  -2.073426 -0.357271 -0.017086
C  -1.129308 1.892059 0.07119
C  -2.250314 1.064647 0.050563
C  2.785875 0.348254 -0.058533
C  2.504054 1.742403 0.009445
C  2.067989 -2.031488 -0.157096
C  -4.503412 -0.746348 0.005111
H  -0.724726 -2.013747 -0.113156
H  -1.222417 2.980873 0.122213
H  -3.251554 1.503034 0.085749
H  3.817011 -0.018673 -0.090578
H  3.319823 2.47358 0.03063
H  1.21121 -2.743192 -0.177491
H  -5.146356 -1.637691 -0.023044
H  -4.719137 -0.103781 -0.86968
H  -4.687293 -0.183691 0.940134
