program: Gaussian 09
title: 000019349
version: EM64L-G09RevD.01
frameworkgroup: C1[X(C8H9Cl2NO)]
method: RPBEPBE
basis: SDD
operation: Freq
keyword: #p
keyword: freq=noraman
keyword: PBEPBE/SDD
title: #p freq=noraman PBEPBE/SDD
converged: YES YES NO NO
title: Mulliken charges:
elementType: Cl Cl O N C C C C C C C C H H H H H H H H H
charge: -0.021476 -0.016124 -0.477789 -0.636830 -0.165139 0.473561 -0.447329 -0.372794 -0.423607 -0.058269 -0.201645 -0.108326 0.205725 0.245448 0.219611 0.314890 0.238539 0.256150 0.373511 0.308607 0.293287
chargesum: 0.00000
title: Mulliken charges with hydrogens summed into heavy atoms:
elementType: Cl Cl O N C C C C C C C C
charge: -0.021476 -0.016124 -0.104278 -0.034936 0.040586 0.473561 0.017730 -0.057904 -0.185068 -0.058269 0.054505 -0.108326
polarizability: 1.67764730e+02 3.96761254e+00 1.17524578e+02 5.48047439e+00 3.50570479e+00 6.07134030e+01
1716.lowfreq: -6.1472 -0.0015 -0.0012 0.0021 1.4355 6.3872 34.3996 61.5727 98.5298
frequency: 34.3546 61.5664 98.5249 137.0356 162.8693 183.8551 207.3983 275.4253 286.7369 313.7655 339.1489 405.6686 420.0469 447.6673 480.0084 541.5796 579.2061 654.8906 681.9041 698.6447 713.3259 782.6987 813.4548 844.6374 902.6397 908.7750 938.4692 950.7538 1003.1148 1044.5690 1066.0786 1111.0482 1128.0913 1143.3135 1195.9728 1243.7335 1264.9558 1274.7281 1302.0941 1350.0117 1375.6081 1381.4512 1397.7346 1457.9613 1462.7213 1571.5719 1597.5916 1640.4755 2906.4438 2966.3414 3065.0066 3130.0081 3167.5701 3179.3342 3218.7638 3471.2661 3596.1898
redmass: 4.9374 6.3156 2.6932 5.0963 5.4523 17.2197 6.3007 2.1538 2.4318 3.5677 4.5821 5.0315 6.9886 3.2954 7.6577 3.0777 4.2996 6.5695 3.7302 1.4362 3.4371 1.1068 1.4068 3.2823 2.5315 1.7524 1.4949 1.3477 5.0743 3.9992 3.3389 1.9616 1.4611 1.4476 2.2522 1.3867 1.3270 1.1863 1.2433 1.2622 5.9627 2.8194 1.5503 1.6143 1.5601 8.0105 6.7420 1.0917 1.0830 1.0657 1.0984 1.0895 1.0954 1.0919 1.0631 1.0464 1.0976
irintensity: 4.8184 0.6869 3.3325 1.5114 1.7912 0.0683 2.3963 2.6654 8.6160 3.2753 3.7084 10.2187 1.0423 6.1742 36.0260 7.0797 5.3337 14.9913 16.5618 118.1109 25.3345 189.2845 36.5091 2.7127 68.9035 23.9710 6.0359 2.5086 29.1928 26.2817 46.9758 20.7104 23.0822 5.7920 25.1712 2.9785 21.7771 5.4641 13.3045 4.3702 13.2184 55.7539 84.9183 33.1079 39.0658 12.6918 4.1996 40.6475 56.7392 47.9265 21.5998 10.8472 3.5933 7.2411 178.1076 1.8529 9.1311
temp: 298.150 k
press: 1.00000 atm
elementType: 17 17 8 7 6 6 6 6 6 6 6 6 1 1 1 1 1 1 1 1 1
symmnumber: 1
zpe: 410192.3 jmol-1
zpe.correction: 0.156234 hartree
zpe.thermalcorrener: 0.168217 hartree
zpe.thermalcorrenthalpy: 0.169161 hartree
zpe.thermalcorrgfe: 0.116770 hartree
zpe.sumelectzpe: -1359.435630 hartree
zpe.sumelectthermal: -1359.423647 hartree
zpe.sumelectthermalent: -1359.422703 hartree
zpe.sumelectthermalfe: -1359.475094 hartree
dipole: -5.7095 -3.2979 1.8697
dipole: 6.8535
quadrupole: -69.0602 -81.9777 -86.1112
quadrupole: 4.9612 -7.7633 3.5493
quadrupole: 9.9895 -2.9280 -7.0615 4.9612 -7.7633 3.5493
hfenergy: -1359.5918643 hartree
pointgroup: C01 [X(C8H9Cl2N1O1)]
dipole: 2.1844841 -0.7999027 -1.3632991 debye
dipolederiv: -0.2958165 0.2667101 0.1172141 0.324948 -0.4732169 -0.1945762 0.134174 -0.1889155 -0.1304676 -0.7832784 -0.0484014 -0.1062671 -0.0497684 -0.0675067 -0.0198486 -0.1239762 -0.0214102 -0.0638223 -0.7042847 -0.0657918 -0.0371729 -0.1926451 -0.5492604 -0.0165172 -0.1683887 -0.0916697 -0.6897117 -0.8221228 -0.1509888 0.04058 -0.2020015 -0.2972825 -0.1456056 0.0835355 -0.1729566 -0.6252056 0.2710257 0.0238644 0.0974076 0.1133728 0.4692545 0.0123968 0.3873459 0.0640851 0.3384737 0.3498617 0.0326511 -0.0152802 -0.0267572 -0.0041261 0.0144558 0.0092677 0.0385339 -0.0675049 0.5847492 0.1348077 0.0432392 0.1055059 0.205091 0.0659003 -0.2776244 0.0398588 0.1326068 -0.2889064 0.1216995 0.0759159 0.0809894 -0.1705302 -0.0426734 0.0599604 -0.0073613 -0.0791521 -0.1053328 -0.0398524 0.0146881 -0.0607669 -0.0086978 0.0774202 -0.0138459 0.0711707 -0.1290285 0.2401527 -0.5061472 -0.2375702 -0.4272096 0.6741512 0.3323229 -0.1967949 0.3030675 0.1080261 -0.189602 -0.0482742 -0.0374799 0.0411155 0.0024085 0.0497797 0.0060481 0.0394877 -0.0724136 1.0057779 0.1973258 0.2430726 0.0792597 -0.1212864 -0.0220396 0.1844802 -0.0054347 -0.0427654 -0.0700172 0.0606028 -0.0368561 0.0577415 -0.2102221 0.0234552 -0.027451 0.0192181 -0.0059274 0.0241619 0.0471656 -0.0413055 0.04963 -0.0504997 0.0926956 -0.0574356 0.0367183 0.0469846 -0.0096172 -0.04822 -0.0232864 -0.0668199 -0.0797283 -0.1578155 -0.0188178 -0.1088354 -0.055862 0.1711845 -0.0206746 -0.0205633 -0.0135285 0.076583 -0.0355852 0.0003751 -0.0435018 0.1374413 0.0054386 0.1040901 0.0238942 0.0952074 0.0010502 -0.0642973 0.0238144 -0.0605628 0.119285 0.0507729 -0.0443156 -0.0339087 -0.0398491 0.0200446 -0.0765554 -0.0414983 -0.0774437 0.1197955 0.3536885 -0.0245235 -0.0866902 0.0312041 0.279718 -0.0162394 -0.075628 0.0133022 0.4619666 0.0946041 -0.0208834 0.0276823 0.0158183 0.213884 0.0835386 0.0853933 0.1370385 0.1854134 0.1175602 0.0291558 -0.0073135 0.0845536 0.0901722 0.0397885 0.027066 0.0156111 0.311868 unknown
polarizability: 167.4721504|-7.2875853|106.0477275|0.4963912|23.5135074|72.4828334 unknown
InChI: InChI=1S/C8H9Cl2NO/c9-6-2-1-5(3-7(6)10)8(12)4-11/h1-3,8,12H,4,11H2
charge 0 multiplicity 1
21 atoms
Cl -2.627944 2.135883 1.096369
Cl -4.058329 -0.40626 -0.432191
O  2.418998 0.715897 1.394938
N  4.161589 0.458584 -0.598221
C  2.044943 -0.294744 0.41917
C  0.536122 -0.333098 0.244527
C  2.772193 0.058517 -0.925033
C  -0.256023 0.746746 0.696726
C  -0.088384 -1.431147 -0.39756
C  -1.649431 0.732249 0.493812
C  -1.483921 -1.442891 -0.602236
C  -2.266624 -0.356538 -0.157834
H  2.396008 -1.298535 0.754437
H  2.264039 0.929024 -1.376517
H  2.696843 -0.788629 -1.637527
H  0.23126 1.5739 1.219233
H  0.506313 -2.289359 -0.731872
H  -1.972709 -2.287829 -1.095957
H  3.34712 0.983147 1.09328
H  4.553632 1.19003 -1.196582
H  4.814506 -0.321346 -0.469761
