program: Gaussian 09
title: 000219264
version: EM64L-G09RevD.01
frameworkgroup: C1[X(C9H13NO4)]
method: RPBEPBE
basis: SDD
operation: Freq
keyword: #p
keyword: freq=noraman
keyword: PBEPBE/SDD
title: #p freq=noraman PBEPBE/SDD
converged: YES YES NO NO
title: Mulliken charges:
elementType: O O O O N C C C C C C C C C H H H H H H H H H H H H H
charge: -0.249525 -0.117007 -0.221444 -0.235752 -0.126780 -0.305942 -0.413517 0.048543 0.120556 -0.326737 0.256064 -0.663308 -0.262778 -0.656693 0.307764 0.234529 0.276649 0.259095 0.217201 0.220610 0.242902 0.227347 0.234504 0.226829 0.215916 0.241676 0.249299
chargesum: 0.00000
title: Mulliken charges with hydrogens summed into heavy atoms:
elementType: O O O O N C C C C C C C C C
charge: -0.249525 -0.117007 -0.221444 -0.235752 -0.126780 0.001822 0.097661 0.048543 0.120556 0.149560 0.256064 0.027550 0.198555 0.050198
polarizability: 1.48596591e+02 5.40670074e+00 1.16970452e+02 -1.55924671e+00 3.99417527e+00 8.51411131e+01
1716.lowfreq: -6.9978 -3.2090 -0.0011 -0.0010 -0.0007 7.5642 24.8647 32.9419 46.6164
frequency: 24.7498 32.5956 46.5949 50.4188 79.9440 88.1445 156.2860 168.8002 187.1226 200.0686 237.3914 272.0532 308.7052 315.1874 329.7210 368.3679 434.3327 437.7530 554.2384 559.7654 591.1482 663.8560 686.3550 708.3008 776.4099 790.7717 810.0059 821.1287 862.2290 913.0116 995.5489 998.2950 1020.5877 1031.0974 1067.4845 1090.3246 1097.6148 1115.3917 1129.9918 1159.1055 1176.0156 1209.3474 1219.1133 1257.1471 1276.0065 1298.8996 1314.9068 1354.0775 1355.9635 1391.5809 1394.1477 1398.7257 1458.4830 1461.8175 1462.7970 1473.4559 1480.3193 1483.3116 1491.2488 1628.0417 1641.4605 1682.5226 2987.1517 2991.2134 2993.8592 2997.0556 3030.1387 3031.7783 3052.1992 3062.4001 3090.2303 3092.8341 3099.0667 3102.1423 3124.2612
redmass: 4.0642 2.7422 3.7663 3.5082 5.1904 5.6272 3.1573 3.9626 1.5363 1.5316 1.6177 2.7892 3.9622 3.2225 6.0402 4.4699 5.8130 3.7538 4.8586 6.3165 4.1112 5.9623 4.7342 5.4319 2.5919 1.2734 1.9332 2.5455 3.2902 3.0021 2.8455 2.2289 1.9739 4.0677 2.9790 2.4904 2.2040 1.9999 2.5111 1.7098 1.4386 1.1951 2.5309 2.0141 1.1244 1.7247 1.6184 1.3249 1.3140 1.2092 1.2257 2.0604 1.0876 1.0754 1.0502 1.0416 1.0638 1.0536 1.1019 8.7018 10.2221 12.7567 1.0632 1.0442 1.0497 1.0364 1.0844 1.0616 1.1033 1.0990 1.0993 1.0982 1.1025 1.1018 1.1059
irintensity: 0.4232 0.6215 3.8605 2.7621 1.0065 0.8465 1.7086 1.7268 3.3373 1.6412 0.5441 1.4354 4.4234 23.4585 2.0642 0.6439 7.7689 12.9678 1.4590 2.6645 1.3443 4.1300 16.0372 3.7096 7.4202 3.8858 2.4736 8.8502 23.8310 1.9675 44.6081 27.1765 29.1771 52.1986 22.7882 43.1034 32.2954 35.4701 177.9188 31.1699 54.7140 46.3748 60.0450 131.0585 7.9066 18.3300 77.4045 11.5555 1.0633 10.9933 25.6285 4.0238 20.9395 18.1391 13.1925 13.3415 9.3839 16.6407 8.3928 145.7529 230.6925 202.2062 32.4914 12.9065 45.0628 14.0076 2.0339 34.7154 10.4353 0.2584 38.4827 27.7435 4.3162 25.8367 28.7033
temp: 298.150 k
press: 1.00000 atm
elementType: 8 8 8 8 7 6 6 6 6 6 6 6 6 6 1 1 1 1 1 1 1 1 1 1 1 1 1
symmnumber: 1
zpe: 560717.3 jmol-1
zpe.correction: 0.213566 hartree
zpe.thermalcorrener: 0.228591 hartree
zpe.thermalcorrenthalpy: 0.229536 hartree
zpe.thermalcorrgfe: 0.169034 hartree
zpe.sumelectzpe: -705.329648 hartree
zpe.sumelectthermal: -705.314623 hartree
zpe.sumelectthermalent: -705.313679 hartree
zpe.sumelectthermalfe: -705.374180 hartree
dipole: 0.5882 -5.0136 -2.5931
dipole: 5.6750
quadrupole: -65.8752 -96.6494 -81.3008
quadrupole: 9.7119 2.5332 0.8747
quadrupole: 15.4000 -15.3743 -0.0257 9.7119 2.5332 0.8747
hfenergy: -705.5432141 hartree
pointgroup: C01 [X(C9H13N1O4)]
dipole: 0.3365537 -2.2068174 0.041542 debye
polarizability: 147.8289285|5.2269138|113.4344249|-5.5172118|-11.6323406|89.4448022 unknown
InChI: InChI=1S/C9H13NO4/c1-3-10-5-6(7(11)8(10)12)9(13)14-4-2/h6H,3-5H2,1-2H3
charge 0 multiplicity 1
27 atoms
O  2.894645 -0.936314 -0.871756
O  0.716849 1.508685 -1.155589
O  -2.280603 1.478016 -0.775611
O  1.846983 -1.320623 1.184211
N  -1.829406 -0.814315 -0.366896
C  0.514664 -0.976358 -0.863225
C  -0.687607 -1.750429 -0.272142
C  0.023655 0.500987 -0.936068
C  -1.499449 0.492543 -0.693319
C  -3.201342 -1.220359 -0.027118
C  1.793952 -1.111632 -0.050941
C  -3.404582 -1.458802 1.485645
C  4.235288 -0.863457 -0.199577
C  4.504677 0.559185 0.294856
H  0.728153 -1.279224 -1.904773
H  -0.907934 -2.675828 -0.834863
H  -0.479738 -2.017343 0.7809
H  -3.861214 -0.406393 -0.375979
H  -3.44918 -2.137188 -0.597601
H  -2.756283 -2.268327 1.866151
H  -3.188888 -0.539696 2.056601
H  -4.453356 -1.74685 1.678741
H  4.250364 -1.595051 0.627433
H  4.933192 -1.169006 -0.994748
H  5.532057 0.621331 0.699012
H  4.408722 1.285796 -0.529224
H  3.801382 0.838854 1.09668
