program: Gaussian 09
title: 000219260
version: EM64L-G09RevD.01
frameworkgroup: C1[X(C10H9Br3O)]
method: RPBEPBE
basis: SDD
operation: Freq
keyword: #p
keyword: freq=noraman
keyword: PBEPBE/SDD
title: #p freq=noraman PBEPBE/SDD
converged: YES YES NO NO
title: Mulliken charges:
elementType: Br Br Br O C C C C C C C C C C H H H H H H H H H
charge: 0.013474 0.045713 0.035865 -0.152060 -0.650605 -0.536026 0.586318 0.355078 -0.395778 -0.310723 -0.223143 -0.236012 -0.787432 -0.231124 0.348882 0.344988 0.236049 0.228886 0.233866 0.232226 0.319716 0.306987 0.234855
chargesum: 0.00000
title: Mulliken charges with hydrogens summed into heavy atoms:
elementType: Br Br Br O C C C C C C C C C C
charge: 0.013474 0.045713 0.035865 -0.152060 -0.301723 -0.191037 0.586318 0.355078 -0.159729 -0.081837 0.010723 -0.003786 -0.160728 0.003731
polarizability: 1.89520838e+02 -2.29197873e+01 1.55127755e+02 -2.49740951e+00 -8.84768334e-01 1.35907273e+02
1716.lowfreq: -0.0001 0.0001 0.0002 3.6940 5.3635 6.6427 20.4718 31.4428 32.9450
frequency: 20.3945 31.4299 32.9362 54.2028 62.3997 105.0853 112.2510 133.0043 152.9104 171.3775 224.8161 232.5297 295.9797 401.1850 424.6871 463.9117 471.7898 536.7721 559.6018 593.8213 617.8404 632.9965 697.7023 716.8675 778.6075 805.0435 847.4203 859.8703 899.2086 927.4083 978.0139 990.3836 1000.4595 1024.4337 1045.3891 1075.1476 1099.6585 1126.4145 1152.3857 1174.8739 1182.5242 1193.1486 1223.8865 1225.5392 1265.0100 1323.6563 1374.8312 1393.6769 1424.6301 1446.8720 1485.5958 1592.8812 1611.5829 1619.8943 3062.1546 3096.2228 3113.7059 3126.2805 3128.6677 3140.4298 3153.5914 3163.3620 3169.0605
redmass: 10.6927 10.5156 5.2592 12.4598 6.8038 8.9436 10.4854 11.0185 5.8474 19.1388 7.2160 6.0239 3.7874 2.7642 4.9624 5.1050 4.5664 5.4857 5.9653 4.6682 6.2750 4.5885 1.6413 4.5078 2.0200 4.9876 1.2623 2.9653 2.1320 1.4539 1.4009 6.0443 1.3347 2.4309 1.9753 1.6368 1.6248 1.2569 1.2287 1.0965 1.3046 1.1437 1.1743 1.9928 2.1152 1.3818 2.1855 3.2271 1.1050 2.1443 2.3265 6.0001 6.0335 9.8091 1.0570 1.0871 1.0871 1.0867 1.0874 1.0915 1.0962 1.1098 1.1016
irintensity: 0.1607 0.3494 0.3489 1.2647 0.6412 0.7478 2.5805 2.0633 9.5343 0.4663 3.8262 0.8022 4.2243 0.2545 27.2790 13.7343 39.4212 52.2732 28.5384 26.3466 0.8570 28.9413 54.4982 5.9861 26.9612 5.2468 0.3236 0.7697 5.2279 0.4870 0.3289 1.6191 0.0157 0.0537 24.8013 11.1501 5.5692 17.8195 9.6240 0.6391 8.0105 9.5611 11.1941 79.7033 30.1773 18.6238 26.4656 9.9684 23.8626 10.5236 1.9443 3.7056 2.4325 94.2422 3.0012 1.0639 0.0675 4.2960 2.7544 11.1215 30.7761 0.7725 19.7397
temp: 298.150 k
press: 1.00000 atm
elementType: 35 35 35 8 6 6 6 6 6 6 6 6 6 6 1 1 1 1 1 1 1 1 1
symmnumber: 1
zpe: 424963.9 jmol-1
zpe.correction: 0.161860 hartree
zpe.thermalcorrener: 0.176755 hartree
zpe.thermalcorrenthalpy: 0.177699 hartree
zpe.thermalcorrgfe: 0.114346 hartree
zpe.sumelectzpe: -501.036402 hartree
zpe.sumelectthermal: -501.021507 hartree
zpe.sumelectthermalent: -501.020563 hartree
zpe.sumelectthermalfe: -501.083916 hartree
dipole: -1.9533 1.8258 1.7573
dipole: 3.1995
quadrupole: -96.7696 -115.6547 -109.8420
quadrupole: 4.1167 0.1870 -1.3642
quadrupole: 10.6525 -8.2326 -2.4199 4.1167 0.1870 -1.3642
hfenergy: -501.198262 hartree
pointgroup: C01 [X(C10H9Br3O1)]
dipole: -0.8271407 -0.9437234 -0.0989996 debye
dipolederiv: -0.4440524 -0.0447808 0.0150474 -0.3041049 -0.6670541 0.2270544 0.2694994 0.3034581 -0.2060394 -0.2488041 -0.0846789 0.0262425 0.0043988 -0.6128603 0.2323172 -0.0196051 0.2424041 -0.1831931 -0.2136697 0.0270708 0.0890833 0.0127296 -0.0900248 0.01359 0.1705706 -0.0115711 -0.3386989 -0.6576405 -0.0258305 0.0365264 0.0135949 -0.467236 -0.2954756 -0.1460489 -0.2500608 -0.4990147 0.7885114 0.1937548 -0.0168322 0.3852475 0.6053694 -0.2486028 -0.2516848 -0.2737349 0.2203191 -0.2977812 -0.0920254 0.0178472 -0.2041781 0.6867491 -0.447105 0.0456606 -0.3583399 0.210328 -0.2517947 -0.0756971 -0.0051674 0.0624426 -0.0909917 0.0411336 -0.0664528 0.0188531 -0.0450756 1.2722515 0.1338663 -0.3201551 0.0315063 0.4463096 0.4993207 0.0892052 0.4163015 0.3954299 -0.0171239 0.0753235 0.0698997 -0.0553294 -0.0845304 0.1017777 -0.0607957 0.0681128 0.0321856 0.0106316 -0.0277642 -0.0844205 0.0465658 -0.0507786 0.0153689 -0.0131105 0.072415 -0.0394148 -0.0039438 -0.0562801 -0.1315316 -0.0568737 -0.112899 0.046632 -0.1607242 0.0296811 -0.0102382 -0.1495433 0.0205639 0.0747077 0.0707793 -0.0564574 0.1151447 0.0963218 0.1272367 0.0496579 -0.206068 0.0882257 0.0774059 0.1062161 0.047904 -0.1768581 -0.0468709 -0.1575717 0.3974445 0.10169 0.0434327 0.0156223 0.0340305 -0.1067031 0.0617027 0.0003856 0.051979 -0.0422896 0.0974871 -0.0185689 0.0155255 -0.0183909 -0.0060331 0.0551933 0.0315231 0.0047739 -0.0128913 0.123966 -0.0223066 0.0017099 0.008396 -0.0228419 0.0629199 -0.017242 -0.0080298 -0.0199729 0.0738277 -0.0465455 -0.0686193 -0.0405812 0.0715546 -0.0878398 -0.0383021 -0.0866852 -0.0084534 -0.0065297 0.0393917 0.1017064 0.0214568 0.0894825 -0.0372916 0.1173425 -0.0476261 0.0392057 -0.0291868 0.0288758 0.0903575 0.0377568 0.1217622 -0.0666766 0.1039332 -0.0660675 0.0187585 0.0601218 -0.0312136 -0.0318851 -0.0476896 0.0811152 -0.1070321 -0.0539818 -0.1117085 -0.0271805 -0.0146871 -0.0035505 0.0184106 -0.0311942 0.1052671 0.0105415 -0.0491968 0.0079228 -0.0491434 0.1215816 -0.0714922 0.0355247 -0.0170686 -0.012378 0.0177847 0.0248207 0.0623292 0.0151616 -0.1092435 -0.0497705 -0.0270059 -0.0597101 0.1252746 -0.0335996 -0.0252472 -0.0340717 0.1031149 unknown
polarizability: 185.2371695|18.2416082|148.8400266|-17.8232277|-12.1494374|146.4786699 unknown
InChI: InChI=1S/C10H9Br3O/c11-6-8(14)10(13)9(12)7-4-2-1-3-5-7/h1-5,9-10H,6H2
charge 0 multiplicity 1
23 atoms
Br 0.685187 2.206935 -0.921629
Br 0.749362 -2.143242 1.134132
Br 4.027183 -0.286303 -1.970646
O  2.754345 0.766732 1.49558
C  0.121861 0.620558 0.325331
C  1.190251 -0.430287 0.048469
C  -1.310973 0.265006 0.049669
C  2.592685 -0.067719 0.572053
C  -2.306705 0.682609 0.969214
C  -1.699076 -0.464612 -1.104949
C  -3.664884 0.366649 0.748413
C  -3.054649 -0.778556 -1.326936
C  3.778201 -0.813421 -0.028573
C  -4.042325 -0.365314 -0.400351
H  0.27164 1.056989 1.324739
H  1.207134 -0.787271 -0.991309
H  -2.014716 1.25169 1.860047
H  -0.946703 -0.775782 -1.838988
H  -4.424084 0.690646 1.468267
H  -3.34455 -1.341358 -2.220791
H  4.706122 -0.53492 0.488488
H  3.623797 -1.903204 -0.043414
H  -5.095805 -0.609726 -0.575316
