program: Gaussian 09
title: 000219255
version: EM64L-G09RevD.01
frameworkgroup: C1[X(C11H13NO2)]
method: RPBEPBE
basis: SDD
operation: Freq
keyword: #p
keyword: freq=noraman
keyword: PBEPBE/SDD
title: #p freq=noraman PBEPBE/SDD
converged: YES YES NO NO
title: Mulliken charges:
elementType: O O N C C C C C C C C C C C H H H H H H H H H H H H H
charge: -0.448202 -0.274131 -0.144304 -0.370322 -0.456344 -0.157853 0.164569 -0.536228 0.494392 -0.444114 -0.365651 -0.216606 -0.224667 -0.241151 0.229201 0.248845 0.253903 0.236719 0.228636 0.224087 0.265211 0.360952 0.231286 0.253195 0.227875 0.229669 0.231033
chargesum: 0.00000
title: Mulliken charges with hydrogens summed into heavy atoms:
elementType: O O N C C C C C C C C C C C
charge: -0.087250 -0.274131 -0.144304 0.107725 0.034278 0.070783 0.164569 -0.046930 0.494392 -0.212828 -0.112456 0.011268 0.005002 -0.010118
polarizability: 1.57909355e+02 -8.94602536e+00 1.19367269e+02 -1.39224934e+01 -3.27753322e+00 9.43511768e+01
1716.lowfreq: -7.9925 -4.0525 -0.0006 -0.0005 -0.0002 11.0071 15.0643 33.7172 51.3989
frequency: 12.6279 33.7141 51.3739 96.4338 154.5609 193.4886 210.8738 243.1243 299.2082 338.0706 383.9631 403.5057 416.5413 460.8476 505.7902 543.8350 584.3737 615.3508 639.8706 703.0805 707.8379 743.2938 769.4188 809.3180 856.6671 872.6922 906.6363 935.2188 950.2273 979.5369 987.2289 990.2737 999.4205 1024.3272 1030.8064 1060.9407 1087.1446 1092.1427 1159.7595 1171.4786 1173.6229 1187.8799 1196.1832 1210.8773 1227.6208 1262.7515 1269.0690 1293.4864 1312.9717 1329.1218 1357.9984 1368.6541 1385.2321 1416.4283 1442.4339 1461.2494 1472.4730 1484.8700 1498.7223 1595.7123 1614.7330 1640.5297 2942.0589 2972.0948 2977.2314 3034.4190 3036.1688 3054.4278 3110.6074 3114.9163 3124.2918 3135.5700 3147.0122 3164.3040 3489.4596
redmass: 4.1131 4.7982 5.0979 5.1571 2.6087 4.4091 3.0370 5.1701 4.2156 2.1895 1.6485 2.8060 2.1484 3.1601 3.8776 5.2225 3.9868 6.1734 4.0833 3.1603 2.5536 2.1103 2.5740 3.6342 1.2480 1.5528 1.6069 1.8683 2.6021 1.3942 2.4670 5.3919 1.3640 2.5466 2.5859 2.5766 1.8400 1.9008 1.6781 1.4524 1.1426 1.1165 1.2333 2.5941 1.1783 1.6899 1.4112 1.4471 1.3872 1.3574 1.4475 1.6754 5.6819 2.7732 2.1059 1.1273 1.0971 2.1762 1.1089 6.0856 6.0451 9.9163 1.0829 1.0651 1.0608 1.0654 1.1004 1.0950 1.1049 1.0876 1.0863 1.0912 1.0961 1.1015 1.0652
irintensity: 0.6290 2.1759 1.0993 4.4754 5.0839 4.0579 14.6995 36.8863 2.2350 6.6772 145.5872 0.0293 15.6825 3.8217 30.5352 2.6241 7.6260 1.0386 12.4987 29.8944 27.8270 30.3736 23.6245 11.2520 0.0283 4.0089 1.3106 9.2185 7.3389 0.4778 34.9072 3.5308 2.1687 4.2335 19.3818 70.3558 6.7107 3.4509 20.4635 6.4944 1.1802 2.1015 12.8053 2.6714 45.9593 57.6248 71.0041 9.4214 17.9341 3.4766 9.2347 9.8274 5.3178 34.6250 8.5324 26.2497 11.2220 10.9060 1.8934 0.2096 5.0387 317.1823 48.0917 35.5821 55.4951 13.1048 8.1967 22.2478 28.8863 9.1122 1.1092 10.8234 36.0185 21.8972 13.4721
temp: 298.150 k
press: 1.00000 atm
elementType: 8 8 7 6 6 6 6 6 6 6 6 6 6 6 1 1 1 1 1 1 1 1 1 1 1 1 1
symmnumber: 1
zpe: 577378.7 jmol-1
zpe.correction: 0.219912 hartree
zpe.thermalcorrener: 0.232498 hartree
zpe.thermalcorrenthalpy: 0.233442 hartree
zpe.thermalcorrgfe: 0.178495 hartree
zpe.sumelectzpe: -631.142444 hartree
zpe.sumelectthermal: -631.129858 hartree
zpe.sumelectthermalent: -631.128914 hartree
zpe.sumelectthermalfe: -631.183861 hartree
dipole: 2.5314 -3.0269 -1.7483
dipole: 4.3158
quadrupole: -84.1455 -76.0546 -88.7170
quadrupole: 5.9410 -0.9132 -1.6854
quadrupole: -1.1731 6.9178 -5.7446 5.9410 -0.9132 -1.6854
hfenergy: -631.3623558 hartree
pointgroup: C01 [X(C11H13N1O2)]
dipole: -0.7722179 -1.5120992 0.0187885 debye
polarizability: 152.0852352|21.3181882|116.0213636|-10.101953|10.8334808|103.5212017 unknown
InChI: InChI=1S/C11H13NO2/c13-10-6-7-12(11(10)14)8-9-4-2-1-3-5-9/h1-5,10,13H,6-8H2
charge 0 multiplicity 1
27 atoms
O  3.755437 1.331602 0.988969
O  1.995608 1.833073 -1.288079
N  1.11354 -0.291017 -0.703737
C  1.48453 -1.4466 0.146415
C  2.644338 -0.890231 1.024445
C  3.245656 0.240652 0.169445
C  2.062554 0.710221 -0.702851
C  -0.125915 -0.230257 -1.49156
C  -1.384423 -0.236143 -0.627308
C  -2.417554 -1.176222 -0.857621
C  -1.540901 0.719146 0.409868
C  -3.592446 -1.162939 -0.06984
C  -2.711385 0.733243 1.198658
C  -3.74168 -0.208216 0.96125
H  1.813295 -2.298662 -0.482625
H  0.617515 -1.773448 0.746505
H  2.247859 -0.439149 1.950315
H  3.374483 -1.668683 1.294704
H  4.045238 -0.135866 -0.505955
H  -0.154446 -1.076713 -2.206145
H  -0.058697 0.707053 -2.07733
H  3.679057 2.162565 0.445094
H  -2.305125 -1.920319 -1.656551
H  -0.746262 1.452732 0.591441
H  -4.385499 -1.895145 -0.258896
H  -2.823817 1.478118 1.994521
H  -4.650462 -0.195999 1.57327
