program: Gaussian 09
title: 000219240
version: EM64L-G09RevD.01
frameworkgroup: C1[X(C16H14Cl2N2)]
method: RPBEPBE
basis: SDD
operation: Freq
keyword: #p
keyword: freq=noraman
keyword: PBEPBE/SDD
title: #p freq=noraman PBEPBE/SDD
converged: YES YES NO NO
title: Mulliken charges:
elementType: Cl Cl N N C C C C C C C C C C C C C C C C H H H H H H H H H H H H H H
charge: -0.054377 -0.054378 -0.130778 -0.130780 0.348797 0.348797 0.083112 0.083114 -0.355372 -0.355373 -0.344843 -0.344842 -0.791732 -0.791732 -0.224035 -0.224036 -0.217457 -0.217457 -0.100042 -0.100041 0.243016 0.243016 0.278913 0.278913 0.276146 0.241195 0.235719 0.241195 0.235719 0.276147 0.255364 0.255364 0.256373 0.256373
chargesum: 0.00000
title: Mulliken charges with hydrogens summed into heavy atoms:
elementType: Cl Cl N N C C C C C C C C C C C C C C C C
charge: -0.054377 -0.054378 -0.130778 -0.130780 0.348797 0.348797 0.083112 0.083114 -0.112356 -0.112357 -0.065930 -0.065929 -0.038671 -0.038671 0.031329 0.031328 0.038916 0.038916 -0.100042 -0.100041
polarizability: 5.09794185e+02 1.26730610e+01 1.68576490e+02 8.25366460e-03 -6.81822229e-03 1.17006481e+02
1716.lowfreq: -1.9150 -0.0032 -0.0030 -0.0013 2.8813 4.4356 18.9126 25.2986 32.7369
frequency: 18.8968 25.2620 32.7242 52.2683 76.0417 84.2778 84.7130 120.2486 143.5964 158.5319 185.8962 201.6543 242.3577 258.0551 297.5136 299.9716 311.4154 321.4960 389.7803 408.6917 411.2947 411.4652 453.5079 454.1175 486.4379 487.7866 537.5637 558.4045 559.4155 624.4749 624.4845 659.2234 678.4331 716.4788 718.9786 753.0507 772.2586 825.3960 825.7363 844.0459 844.3320 889.8144 954.1984 954.2564 975.2206 986.2866 986.3388 996.0317 996.3982 1026.1959 1032.7181 1052.4418 1067.2599 1071.4411 1077.0694 1085.0270 1112.3743 1118.7592 1183.3639 1184.2206 1293.4323 1294.3809 1306.3554 1321.5714 1361.4522 1362.6703 1381.2772 1381.3277 1398.7506 1400.0718 1451.0921 1456.7786 1470.9091 1472.5420 1481.9253 1482.5414 1529.3471 1552.6910 1578.0154 1581.3275 1597.0022 1600.4928 2980.7921 2981.2733 3064.6585 3065.1637 3100.6244 3101.6974 3151.0369 3151.0416 3156.6695 3156.6968 3172.3438 3172.3479 3176.7283 3176.7653
redmass: 5.2131 5.2987 8.7225 3.8382 4.4296 5.9265 5.9005 4.7585 1.2800 1.2192 3.7032 8.9346 5.1285 6.0571 4.6434 4.1102 7.5328 3.5427 4.8146 3.0693 5.1415 3.0364 3.8834 3.8944 4.7248 4.1031 7.2693 2.8142 2.8048 7.0991 7.0872 5.3102 5.3068 3.6458 3.6039 5.4589 4.5449 1.3260 1.3366 1.4228 1.4282 3.4264 1.3500 1.3487 1.9976 1.3676 1.3615 3.9632 4.0076 1.8381 1.6193 2.3264 3.9033 3.4902 2.0146 2.4512 1.3407 1.3898 1.1309 1.1294 1.2951 1.2568 3.6857 3.9696 3.8454 3.9132 1.3969 1.3440 3.9979 3.6522 1.1640 1.1725 1.2225 1.1918 2.0196 1.8209 5.0014 5.8557 7.5600 7.4920 6.2066 6.4126 1.0377 1.0378 1.0951 1.0949 1.1000 1.1000 1.0880 1.0880 1.0883 1.0883 1.0964 1.0964 1.0975 1.0976
irintensity: 0.7136 0.0663 0.1087 0.1672 2.6845 0.6061 0.2725 1.0901 0.4489 0.0032 2.3657 1.2430 0.1176 0.0763 12.2518 0.0769 2.2359 1.9565 4.4499 0.6492 2.0610 0.5876 5.6470 7.9228 4.4997 0.8247 85.4046 12.9759 17.9942 0.1121 0.5373 3.7585 0.0210 1.6427 1.5704 46.8632 8.2660 13.6807 27.5469 63.6865 25.3383 0.1357 0.0590 0.0517 6.3301 3.0821 1.4313 101.8779 1.3501 7.0645 5.6430 5.0734 6.3767 0.0590 142.4212 2.2655 14.0888 2.3498 0.1664 20.4875 0.4592 0.6886 119.4788 5.0998 0.0574 7.6150 65.5792 16.8570 9.4928 49.5026 74.2356 3.9581 61.9478 9.5760 4.6230 94.2669 0.0593 58.6056 1.8699 20.8185 57.5770 1.8535 28.7460 5.9759 13.4731 12.3592 21.0925 1.0933 2.1983 10.3153 1.9977 0.0265 12.1491 5.5152 5.2406 0.1903
temp: 298.150 k
press: 1.00000 atm
elementType: 17 17 7 7 6 6 6 6 6 6 6 6 6 6 6 6 6 6 6 6 1 1 1 1 1 1 1 1 1 1 1 1 1 1
symmnumber: 1
zpe: 670348.3 jmol-1
zpe.correction: 0.255322 hartree
zpe.thermalcorrener: 0.274452 hartree
zpe.thermalcorrenthalpy: 0.275397 hartree
zpe.thermalcorrgfe: 0.204849 hartree
zpe.sumelectzpe: -1646.288754 hartree
zpe.sumelectthermal: -1646.269624 hartree
zpe.sumelectthermalent: -1646.268680 hartree
zpe.sumelectthermalfe: -1646.339228 hartree
dipole: -0.0001 0.0003 2.0247
dipole: 2.0247
quadrupole: -159.6045 -119.2244 -129.2783
quadrupole: 9.4522 -0.0021 -0.0012
quadrupole: -23.5688 16.8114 6.7574 9.4522 -0.0021 -0.0012
hfenergy: -1646.5440766 hartree
pointgroup: C01 [X(C16H14Cl2N2)]
dipole: -0.0000183 0.000108 0.7965669 debye
polarizability: 510.2162666|4.0504998|168.1544078|0.008079|-0.0070243|117.006481 unknown
InChI: InChI=1S/C16H14Cl2N2/c1-11(13-3-7-15(17)8-4-13)19-20-12(2)14-5-9-16(18)10-6-14/h3-10H,1-2H3
charge 0 multiplicity 1
34 atoms
Cl -7.475766 0.666595 -0.681326
Cl 7.475357 -0.667119 -0.680816
N  -0.672916 0.171488 -0.314998
N  0.672495 -0.171891 -0.314921
C  -2.989026 -0.395183 -0.086423
C  2.988594 0.394836 -0.086391
C  -1.553483 -0.734067 0.092409
C  1.553045 0.733769 0.09229
C  -4.011224 -1.202216 0.485523
C  4.010772 1.202037 0.485356
C  -3.375737 0.751507 -0.840811
C  3.375335 -0.752073 -0.840431
C  -1.151089 -2.049394 0.731943
C  1.150622 2.049263 0.731462
C  -5.375986 -0.885446 0.311208
C  5.375541 0.885217 0.311183
C  -4.731283 1.077263 -1.027703
C  4.730888 -1.077884 -1.027177
C  -5.716391 0.250427 -0.44609
C  5.715973 -0.250879 -0.445769
H  -3.751686 -2.083028 1.080875
H  3.751211 2.083023 1.080439
H  -2.590505 1.374419 -1.278815
H  2.59012 -1.375114 -1.278284
H  -0.083352 -2.23904 0.533891
H  -1.293368 -2.022791 1.829667
H  -1.751995 -2.887317 0.33773
H  1.292866 2.022949 1.829198
H  1.751536 2.887086 0.337049
H  0.082891 2.238851 0.533326
H  -6.156608 -1.50889 0.756354
H  6.156145 1.508794 0.756173
H  -5.021891 1.954101 -1.613656
H  5.021517 -1.954894 -1.612862
