program: Gaussian 09
title: 000219238
version: EM64L-G09RevD.01
frameworkgroup: C1[X(C3H8N6O3)]
method: RPBEPBE
basis: SDD
operation: Freq
keyword: #pfreq=noraman
keyword: PBEPBE/SDD
title: #p freq=noraman PBEPBE/SDD
converged: YES YES NO NO
title: Mulliken charges:
elementType: O O O N N N N N N C C C H H H H H H H H
charge: -0.272903 -0.274803 -0.274928 -0.354996 -0.354927 -0.346205 -0.346156 -0.630662 -0.630672 0.331502 0.291018 0.291028 0.319973 0.319957 0.313875 0.313940 0.309038 0.343427 0.343434 0.309060
chargesum: 0.00000
title: Mulliken charges with hydrogens summed into heavy atoms:
elementType: O O O N N N N N N C C C
charge: -0.272903 -0.274803 -0.274928 -0.035023 -0.034971 -0.032330 -0.032216 0.021803 0.021822 0.331502 0.291018 0.291028
polarizability: 1.06520525e+02 4.64311863e-02 7.50951594e+01 -6.34050944e-03 -6.82674595e+00 7.27050953e+01
1716.lowfreq: -11.3017 -5.0911 -0.0009 -0.0005 0.0005 5.2472 8.3761 33.4598 54.5962
frequency: -11.0045 33.4429 54.5897 55.9606 73.2909 75.3587 167.0143 179.1698 207.7325 266.6574 283.2527 342.4551 342.6125 374.6085 441.3998 450.6177 475.8052 496.6953 497.9466 520.6004 524.0422 649.3160 664.5421 705.8672 725.9236 740.1386 745.9018 909.4319 916.8334 985.2942 1047.1800 1048.7524 1148.8962 1262.6249 1282.3044 1332.2061 1334.5343 1452.2001 1459.0684 1488.6485 1490.9068 1605.5044 1606.4219 1657.3491 1670.3239 1681.0905 3529.4150 3536.9420 3540.1490 3541.2015 3551.2663 3552.2383 3695.2659 3695.3116
redmass: 5.2718 7.6456 4.5857 4.5549 7.7244 5.1213 1.3152 1.4985 1.4253 2.7115 3.2588 5.7700 4.2036 2.3039 1.2725 2.8666 1.4799 1.1512 1.1646 1.4489 3.2340 5.9882 7.1405 8.0813 8.1536 7.3442 6.0820 3.0212 3.0783 6.0965 2.2404 2.2073 3.7273 3.0676 4.9490 2.1922 2.2174 1.5028 1.7851 1.5631 1.7062 1.2307 1.2462 5.6853 4.7669 5.2964 1.0785 1.0757 1.0522 1.0540 1.0711 1.0723 1.1039 1.1039
irintensity: 0.6626 0.7869 12.9191 12.2332 24.6201 21.7587 1.3889 10.3205 0.7708 22.7193 1.4367 47.3510 14.3766 8.5065 59.2222 125.8100 185.2171 177.8990 51.3509 544.8774 5.5331 8.0236 17.6612 10.4020 25.8263 10.6149 0.5175 28.0293 2.9978 19.9399 0.7922 14.0329 120.9796 229.5994 22.5305 87.8268 79.4665 77.0287 389.0820 205.5730 36.2867 66.6164 73.9646 461.7075 97.6806 240.4351 16.0034 33.7162 54.3981 20.4847 1.1916 51.8436 14.4626 64.4958
temp: 298.150 k
press: 1.00000 atm
elementType: 8 8 8 7 7 7 7 7 7 6 6 6 1 1 1 1 1 1 1 1
symmnumber: 1
zpe: 383500.7 jmol-1
zpe.correction: 0.146068 hartree
zpe.thermalcorrener: 0.159342 hartree
zpe.thermalcorrenthalpy: 0.160286 hartree
zpe.thermalcorrgfe: 0.104889 hartree
zpe.sumelectzpe: -672.367109 hartree
zpe.sumelectthermal: -672.353835 hartree
zpe.sumelectthermalent: -672.352890 hartree
zpe.sumelectthermalfe: -672.408288 hartree
dipole: -0.0049 -4.9815 1.7129
dipole: 5.2678
quadrupole: -40.3715 -75.0517 -63.7721
quadrupole: 0.0202 0.0398 5.4273
quadrupole: 19.3603 -15.3200 -4.0404 0.0202 0.0398 5.4273
hfenergy: -672.5131766 hartree
pointgroup: C01 [X(C3H8N6O3)]
dipole: -0.001898 -1.8836804 -0.8643207 debye
dipolederiv: -0.655615 -0.0003985 0.0003383 -0.0003735 -0.7610617 0.3148633 0.0008679 0.2962535 -0.5992395 -0.569233 -0.1554963 0.0443862 -0.109089 -0.9783277 -0.1832239 0.1399595 -0.1528172 -0.5379486 -0.5682114 0.154257 -0.0454848 0.1076753 -0.9805493 -0.1814124 -0.140992 -0.150441 -0.5371413 -0.7211721 0.1655038 -0.149947 0.3087835 -0.2716826 -0.2250068 -0.5211818 0.0175068 -0.4070897 -0.7237471 -0.1648165 0.1488144 -0.3067377 -0.2718367 -0.2261204 0.521248 0.0162771 -0.4047713 -0.27889 0.1239348 -0.0489863 0.5190009 -0.3187401 -0.122115 0.2747436 -0.1755872 -0.727053 -0.2804793 -0.1235678 0.0501746 -0.5200525 -0.3188307 -0.1246589 -0.2734949 -0.1769447 -0.7260472 -1.2289644 -0.2114221 0.155077 -0.2009653 -0.4373882 0.2471971 0.2005538 0.2300127 -0.7255478 -1.2272925 0.2124167 -0.1561344 0.2020858 -0.4367361 0.2469459 -0.2014398 0.2296566 -0.728118 1.9936645 -0.0005682 0.0003457 -0.0009716 0.9274103 -0.3921466 -0.0002946 -0.5331757 0.7605308 1.2882501 0.3414049 -0.5864642 0.0645072 1.3440452 0.3481505 -0.8665921 0.2736769 1.1884902 1.2848346 -0.3391035 0.5889494 -0.0615825 1.347794 0.3459166 0.8678268 0.2704637 1.188697 0.0849638 -0.0090615 0.0510311 -0.0519864 0.1564691 0.1135329 0.0500494 0.0382664 0.3185245 0.0855783 0.008886 -0.0512043 0.0519368 0.1567388 0.113901 -0.0502239 0.0386169 0.3181655 0.1380219 -0.0198029 0.1125944 -0.0814861 0.11827 -0.0493911 0.1653555 -0.0230008 0.2435666 0.1392111 0.0191364 -0.1130218 0.0808074 0.1179395 -0.0483452 -0.1658486 -0.0221019 0.2433662 0.3182386 -0.0190579 0.0864656 -0.0415379 0.1165159 -0.0489196 0.1148713 -0.0396869 0.2763228 0.300863 -0.0410111 0.078406 -0.0706454 0.1872691 -0.0409137 0.0807635 -0.049446 0.2893441 0.3013257 0.0404758 -0.0787121 0.0700525 0.1866517 -0.0402235 -0.0810728 -0.0487661 0.2895473 0.3186532 0.018291 -0.086628 0.0405786 0.1160496 -0.0480301 -0.1150987 -0.0387632 0.2764015 unknown
polarizability: 106.5204809|0.0288398|80.776363|0.0581691|0.8658305|67.0239356 unknown
InChI: InChI=1S/C3H8N6O3/c4-1(10)6-8-3(12)9-7-2(5)11/h6-9H,4-5H2
charge 0 multiplicity 1
20 atoms
O  -0.002321 -1.558655 0.108134
O  -2.570619 1.479619 0.630977
O  2.573476 1.479411 0.629594
N  -1.174327 -0.040087 -1.253452
N  1.175834 -0.04311 -1.251303
N  -2.407837 -0.420681 -0.731846
N  2.407403 -0.425476 -0.726295
N  -4.014683 -0.330993 0.982452
N  4.011859 -0.333944 0.990145
C  -0.000424 -0.589506 -0.696594
C  -2.96281 0.315447 0.343533
C  2.9627 0.312962 0.347272
H  -1.165393 0.854236 -1.747984
H  1.170024 0.850273 -1.747551
H  -2.705429 -1.371937 -0.951726
H  2.702468 -1.378392 -0.942325
H  -4.207035 -1.325057 0.878762
H  -4.498961 0.189846 1.709209
H  4.496639 0.188359 1.715515
H  4.201635 -1.328916 0.890482
