program: Gaussian 09
title: 000219236
version: EM64L-G09RevD.01
frameworkgroup: C1[X(C4H12N2O2S)]
method: RPBEPBE
basis: SDD
operation: Freq
keyword: #p
keyword: freq=noraman
keyword: PBEPBE/SDD
title: #p freq=noraman PBEPBE/SDD
converged: YES YES NO NO
title: Mulliken charges:
elementType: S O O N N C C C C H H H H H H H H H H H H
charge: 1.065279 -0.535350 -0.535834 -0.502512 -0.501550 -0.345607 -0.345474 -0.659826 -0.659887 0.322281 0.322055 0.258495 0.236886 0.258761 0.236822 0.205505 0.267118 0.220112 0.205458 0.267312 0.219957
chargesum: 0.00000
title: Mulliken charges with hydrogens summed into heavy atoms:
elementType: S O O N N C C C C
charge: 1.065279 -0.535350 -0.535834 -0.180232 -0.179495 0.149774 0.150109 0.032909 0.032839
polarizability: 1.08620079e+02 2.81028818e-02 8.63209738e+01 -2.01797068e-01 -1.22531696e-02 8.09051524e+01
1716.lowfreq: -0.0004 0.0016 0.0028 12.4195 13.0797 14.2439 53.3383 54.8602 111.1004
frequency: 53.2291 54.4734 111.0906 127.9099 159.7721 171.6138 195.7294 244.8058 251.9860 287.7766 294.0577 345.5131 415.6977 438.8896 446.5791 457.8954 481.2260 731.9704 757.2032 811.2074 814.1641 844.1764 881.8615 882.6922 935.5753 1048.8592 1049.6953 1089.2805 1089.6035 1129.3811 1130.4932 1255.0799 1259.6006 1304.3473 1318.7592 1372.7667 1383.5756 1395.0753 1395.2773 1454.2855 1454.4975 1471.7328 1471.9324 1486.5522 1486.6222 2981.0503 2981.2951 2996.4989 2997.0819 3058.8942 3059.5579 3079.3868 3079.6458 3100.4775 3100.6360 3391.3487 3392.5087
redmass: 3.6350 2.9924 2.1817 4.1691 3.0595 1.9093 4.8388 1.2014 1.3889 7.8978 7.0471 2.9183 3.7061 4.8117 2.5143 4.1449 2.5688 1.2681 1.2441 8.1488 1.4010 1.5816 2.1931 2.1672 10.2711 3.3301 3.2758 1.8178 1.8051 1.6662 1.6992 1.1723 1.1458 1.2104 1.2266 1.2239 1.1871 1.1996 1.1958 1.0683 1.0681 1.0414 1.0411 1.0511 1.0511 1.0366 1.0365 1.0644 1.0646 1.0987 1.0986 1.0988 1.0987 1.1011 1.1011 1.0747 1.0750
irintensity: 2.0318 1.2528 0.2188 3.4139 1.7772 1.1878 0.8562 0.1904 0.5452 3.4880 26.5656 8.5944 0.5033 30.6331 13.6739 90.5649 70.0586 4.8513 128.4603 86.5733 0.0577 157.3772 1.0989 5.0851 83.2569 47.5767 0.8084 0.6149 10.3347 17.0760 18.5868 7.3695 7.1018 10.3859 3.5356 12.4806 0.7824 38.6200 12.5769 10.5422 10.7291 14.4275 12.0615 19.0978 7.6553 54.9334 2.5957 1.3797 32.9470 3.3854 2.4936 43.9227 26.6934 17.9744 9.7570 0.7601 32.6348
temp: 298.150 k
press: 1.00000 atm
elementType: 16 8 8 7 7 6 6 6 6 1 1 1 1 1 1 1 1 1 1 1 1
symmnumber: 1
zpe: 445387.0 jmol-1
zpe.correction: 0.169639 hartree
zpe.thermalcorrener: 0.181700 hartree
zpe.thermalcorrenthalpy: 0.182644 hartree
zpe.thermalcorrgfe: 0.131655 hartree
zpe.sumelectzpe: -816.681113 hartree
zpe.sumelectthermal: -816.669052 hartree
zpe.sumelectthermalent: -816.668108 hartree
zpe.sumelectthermalfe: -816.719097 hartree
dipole: -0.0173 -4.0040 -0.0006
dipole: 4.0040
quadrupole: -53.7312 -70.0735 -64.5627
quadrupole: -0.0623 -7.2510 0.0540
quadrupole: 9.0579 -7.2844 -1.7735 -0.0623 -7.2510 0.0540
hfenergy: -816.8507524 hartree
pointgroup: C01 [X(C4H12N2O2S1)]
dipole: -0.0023801 1.5433598 0.3155543 debye
dipolederiv: 1.994721 -0.0304999 0.1444984 -0.0557049 1.3477327 0.0054955 0.2762471 0.0053395 1.3216121 -0.7186634 0.0722094 0.0300292 0.0179047 -0.57251 -0.0546915 0.0235711 -0.2113549 -0.6772422 -0.7197834 -0.0775479 -0.0005438 -0.0257445 -0.6845776 0.0518445 0.0153906 0.2098193 -0.5676368 -0.759697 -0.0812402 0.0776781 -0.0314968 -0.3121362 -0.0883773 0.1043069 -0.088103 -0.4907509 -0.7559512 0.0470363 0.1068655 -0.0092824 -0.3988967 0.1257052 0.1121943 0.1243648 -0.4046997 0.4382469 0.0500942 -0.0643478 0.0464094 0.2032091 0.0331819 -0.3457596 -0.1086963 0.0957814 0.4318933 -0.0202835 -0.081891 0.0894648 0.1598929 -0.0068622 -0.3414208 0.1370145 0.1415989 -0.1664581 0.0214767 0.0718753 0.0435603 -0.0320507 -0.0850559 0.1097832 -0.0407703 0.0489016 -0.1649786 -0.0468559 0.0613337 -0.0815942 -0.0637884 0.0399293 0.0880066 -0.0041793 0.0792441 0.1250943 -0.0168307 -0.1021321 -0.1019646 0.0499934 0.0640571 -0.0566368 0.0429044 0.2349234 0.1239997 0.0532222 -0.0891385 0.1148586 0.1135846 -0.1145109 -0.0134264 -0.0931963 0.1716949 0.0363034 0.0702427 -0.0548143 0.0723823 0.0727571 0.0378838 -0.0084546 0.086074 0.0041026 -0.0418052 -0.0820974 -0.0161887 -0.0656185 -0.0449601 -0.1131409 0.0538906 -0.0871175 0.0201234 0.036057 -0.0453883 -0.0774741 -0.0641506 0.106459 0.0041183 -0.0351064 -0.0441225 -0.0282382 -0.0403552 0.0829857 0.0170748 0.0409349 -0.1052408 0.0620355 0.0762569 0.034933 0.0796437 0.0388949 0.0489073 -0.0337482 0.0752401 0.0416408 0.0801508 -0.1068908 0.0999737 -0.0896532 0.1367304 -0.0386213 -0.0576413 0.0207443 0.0175885 -0.0770048 -0.0184228 -0.0780603 0.0227095 -0.0849657 -0.1003897 0.0626829 -0.1206219 -0.0055919 0.0743847 0.0910769 0.070969 0.0789734 0.0371921 -0.0330412 -0.0513091 -0.0301883 0.0857278 -0.0090681 -0.1287987 -0.0288583 -0.1321513 0.1360114 0.0573465 -0.0394042 -0.0128994 -0.0350002 0.0543486 -0.026169 0.0541602 0.0764301 -0.0824868 0.0692747 0.0965951 0.0777669 0.0561667 -0.0844238 0.1303618 -0.081094 0.0146334 unknown
polarizability: 108.6209785|-0.0728598|86.1089233|-0.0972816|1.0514765|81.1163031 unknown
InChI: InChI=1S/C4H12N2O2S/c1-3-5-9(7,8)6-4-2/h5-6H,3-4H2,1-2H3
charge 0 multiplicity 1
21 atoms
S  -0.015846 -0.394096 -0.200105
O  0.756866 -0.955331 -1.518778
O  -0.785174 -1.422852 0.800046
N  0.992261 0.627955 0.939545
N  -1.026136 0.986848 -0.857442
C  2.059228 1.447068 0.297109
C  -2.08215 1.505662 0.05776
C  3.331698 0.675155 -0.108761
C  -3.354917 0.639702 0.1591
H  1.329079 -0.028892 1.667426
H  -1.373777 0.656519 -1.776518
H  1.598327 1.942936 -0.575751
H  2.293544 2.242764 1.031026
H  -1.609098 1.636817 1.047246
H  -2.31963 2.518987 -0.321082
H  3.79983 0.185592 0.766102
H  3.091444 -0.095983 -0.860501
H  4.074938 1.367285 -0.54527
H  -3.832739 0.512088 -0.830648
H  -3.112959 -0.356606 0.566997
H  -4.090989 1.120783 0.828998
