program: Gaussian 09
title: 000219234
version: EM64L-G09RevD.01
frameworkgroup: C1[X(C6H11N4PS)]
method: RPBEPBE
basis: SDD
operation: Freq
keyword: #p
keyword: freq=noraman
keyword: PBEPBE/SDD
title: #p freq=noraman PBEPBE/SDD
converged: YES YES NO NO
title: Mulliken charges:
elementType: S P N N N N C C C C C C H H H H H H H H H H H
charge: -0.291343 0.571421 -0.602881 -0.581529 -0.493724 -0.499861 -0.031687 -0.276980 -0.306993 -0.212314 -0.208915 -0.222954 0.273431 0.281401 0.346186 0.344812 0.236501 0.236915 0.235244 0.299358 0.302600 0.299899 0.301412
chargesum: 0.00000
title: Mulliken charges with hydrogens summed into heavy atoms:
elementType: S P N N N N C C C C C C
charge: -0.291343 0.571421 -0.256695 -0.236717 0.108233 0.101451 -0.031687 -0.003548 -0.025591 0.024187 0.028000 0.012291
polarizability: 1.74205317e+02 6.93929117e+00 1.24069535e+02 4.95471303e+00 1.65962973e+01 1.07302075e+02
1716.lowfreq: -0.0017 -0.0012 0.0016 2.0313 7.3834 11.4772 32.7693 53.8395 72.1820
frequency: 32.7568 53.7509 72.1711 96.6833 125.8518 129.7245 186.0626 224.3310 236.4184 274.5182 303.8175 311.4398 367.2276 398.2800 429.5058 457.0547 473.9244 510.3790 529.0647 565.9919 611.5585 689.6656 700.4946 701.6005 719.8755 760.2423 808.8030 812.3200 866.3318 942.0080 986.1425 988.4751 1006.2333 1019.7853 1077.6796 1085.1433 1142.0422 1158.5278 1174.6154 1187.2570 1255.7300 1266.1565 1308.0581 1363.6588 1380.8781 1394.5198 1425.9851 1463.0502 1585.7211 1593.5435 1668.7146 1674.1657 3127.8872 3133.7771 3144.2104 3155.4432 3168.2782 3360.6708 3363.1117 3478.0726 3479.9229 3529.3091 3535.5810
redmass: 4.0597 3.9941 4.6361 5.0030 6.4749 5.8713 2.9222 2.2656 3.9235 2.9183 2.8937 3.2051 2.4515 2.8052 3.1480 4.6860 2.9436 1.4376 2.6912 3.3495 6.1195 3.3261 2.0305 1.9942 1.4956 1.5234 2.5961 2.2174 1.2422 1.3711 5.9730 1.3837 1.3268 2.9781 1.6063 2.7514 4.4571 4.4152 1.0561 1.1270 1.1472 1.1476 1.3202 1.1158 8.2022 1.1112 2.1105 2.0436 6.0777 5.8442 1.0591 1.0594 1.0863 1.0881 1.0918 1.0963 1.1016 1.0481 1.0475 1.0767 1.0769 1.0945 1.0941
irintensity: 0.1230 0.8464 0.3764 0.8644 8.7081 10.6109 7.7369 22.1036 11.4857 13.8250 28.5358 3.6239 8.6970 0.8128 17.3799 0.5796 22.7591 43.2778 40.8339 212.8066 7.3053 84.6509 121.0300 183.0075 288.7834 63.3723 21.8427 9.3126 0.7273 0.8272 1.1246 0.5451 0.1746 2.8715 3.5978 35.4665 15.6728 13.9990 0.0279 4.3275 0.4182 0.2954 4.4954 2.7341 0.3713 12.7185 21.8485 10.6424 0.1235 0.2497 26.0606 21.7648 0.3581 1.4597 3.5866 17.8165 32.1122 1.7730 3.2943 17.8396 11.7606 4.1365 6.0215
temp: 298.150 k
press: 1.00000 atm
elementType: 16 15 7 7 7 7 6 6 6 6 6 6 1 1 1 1 1 1 1 1 1 1 1
symmnumber: 1
zpe: 466987.4 jmol-1
zpe.correction: 0.177866 hartree
zpe.thermalcorrener: 0.191529 hartree
zpe.thermalcorrenthalpy: 0.192473 hartree
zpe.thermalcorrgfe: 0.136696 hartree
zpe.sumelectzpe: -1192.554220 hartree
zpe.sumelectthermal: -1192.540557 hartree
zpe.sumelectthermalent: -1192.539613 hartree
zpe.sumelectthermalfe: -1192.595390 hartree
dipole: 2.6454 1.0596 1.2964
dipole: 3.1307
quadrupole: -75.4305 -87.8721 -90.9854
quadrupole: -1.8347 -2.7245 0.2782
quadrupole: 9.3322 -3.1094 -6.2227 -1.8347 -2.7245 0.2782
hfenergy: -1192.732086 hartree
pointgroup: C01 [X(C6H11N4P1S1)]
dipole: -1.0583722 0.0563194 -0.6275272 debye
dipolederiv: -0.6354321 -0.050199 -0.1738394 0.0543441 -0.4701161 -0.0073468 -0.0736743 0.0478146 -0.6968449 1.4876517 0.1832716 0.2268354 0.0379153 0.9223786 0.0402393 0.2006977 -0.0925929 1.4353797 -0.2440803 -0.2895687 -0.1307245 -0.1765388 -0.2366501 0.1457251 -0.1130174 -0.0849011 -0.699279 -0.4587376 0.2233941 -0.2210908 0.2472735 -0.1107222 0.0323786 0.0428236 0.3007441 -0.5206079 -0.2207339 0.0431063 0.0171486 0.2350285 -0.6702596 -0.3355799 0.0583926 -0.2276781 -0.152763 -0.3026185 -0.3392128 0.211469 -0.2271385 -0.3781379 0.1586735 0.2311665 0.2236808 -0.3026683 -0.2072405 -0.0313993 0.022931 -0.0518048 -0.3405166 -0.0497979 -0.1317654 0.0066921 -0.2674253 -0.137437 0.0668765 -0.1396269 -0.0691138 -0.0573312 -0.0728695 0.1395725 -0.0438319 -0.0074762 -0.1532703 -0.0642637 0.1229889 0.0749151 -0.0842298 -0.017338 -0.10202 -0.0456892 -0.024209 -0.0716169 -0.0614181 0.1307419 -0.0228827 -0.094293 -0.0697073 0.0862311 -0.0766779 0.0217833 -0.0376544 0.0522947 -0.1352022 0.0426907 -0.0943261 -0.0699844 -0.0612583 -0.0684114 0.0509409 0.1069873 -0.0033835 -0.0082106 0.0053992 -0.1174066 -0.0516778 -0.0288587 -0.0511589 -0.0323818 0.1100436 -0.0234749 0.0747058 -0.0284229 0.1112547 0.0510627 0.0499283 0.0486994 0.0361046 0.1227824 0.0371203 -0.0688482 0.0137871 0.1185821 0.030874 -0.0468866 0.0409463 0.0465365 0.0827111 0.0219253 0.0376807 -0.0555624 0.0787564 -0.0250316 0.039776 -0.0317312 0.2325949 0.1545445 -0.0464856 0.0783901 -0.0618438 0.0557287 -0.042566 0.0481331 -0.0400334 0.1616612 -0.0069803 0.0409439 -0.0753173 0.0471575 0.1140924 0.0869593 -0.089696 0.0861449 -0.0112843 0.0047532 -0.0285333 0.0701834 -0.0406818 0.1235887 0.0793439 0.0906364 0.080411 -0.0245531 -0.1315322 0.0085878 0.0077509 0.0065155 0.1432567 0.0208514 0.0071856 0.0228456 0.1051082 0.074213 -0.0149815 0.035287 -0.0835386 0.1912687 0.1413517 -0.024762 0.1262724 0.2287544 0.0942284 0.0812062 0.0039195 -0.1110696 0.4203479 0.0387563 -0.0729901 0.1128592 0.0798959 0.2634914 0.1032078 -0.0906377 0.0983129 0.1847554 -0.0024336 -0.2246142 -0.1543411 0.1419531 0.1059274 0.090986 0.0034654 0.0652584 0.189979 -0.0818831 -0.0250003 -0.1800634 0.1987801 unknown
polarizability: 174.2901444|-5.8094226|101.8664152|6.3508251|-12.2298838|129.4203675 unknown
InChI: InChI=1S/C6H11N4PS/c7-9-11(12,10-8)6-4-2-1-3-5-6/h1-5,9-10H,7-8H2
charge 0 multiplicity 1
23 atoms
S  2.016428 -0.161952 1.788197
P  1.012285 -0.068983 -0.054883
N  1.314234 -1.459786 -1.146374
N  1.596824 1.269708 -1.079773
N  2.540125 -2.170957 -1.044343
N  2.240223 2.396808 -0.512313
C  -0.84167 0.019157 0.028451
C  -1.566856 0.572917 -1.053609
C  -1.510714 -0.478396 1.171418
C  -2.978526 0.608928 -0.995991
C  -2.921695 -0.436254 1.22217
C  -3.655462 0.101912 0.138026
H  -1.027717 0.988079 -1.912119
H  -0.924518 -0.870843 2.010925
H  0.508771 -2.084829 -1.267807
H  2.026042 0.942889 -1.953342
H  -3.546657 1.036152 -1.829384
H  -3.44601 -0.817296 2.105113
H  -4.749867 0.134948 0.181316
H  3.278339 -1.732741 -1.604922
H  2.831344 -2.345787 -0.068095
H  2.89511 2.147906 0.247327
H  1.562767 3.112323 -0.227489
