program: Gaussian 09
title: 000219229
version: EM64L-G09RevD.01
frameworkgroup: C1[X(C6H12S2)]
method: RPBEPBE
basis: SDD
operation: Freq
keyword: #pfreq=noraman
keyword: PBEPBE/SDD
title: #p freq=noraman PBEPBE/SDD
converged: YES YES NO NO
title: Mulliken charges:
elementType: S S C C C C C C H H H H H H H H H H H H
charge: 0.294136 0.076831 -0.055236 -0.655952 -0.671324 -0.684083 -0.488969 -0.581584 0.222410 0.262058 0.252371 0.202922 0.217810 0.236681 0.207203 0.224094 0.215182 0.260550 0.232595 0.232304
chargesum: 0.00000
title: Mulliken charges with hydrogens summed into heavy atoms:
elementType: S S C C C C C C
charge: 0.294136 0.076831 0.167174 -0.141524 -0.013910 -0.037603 -0.488969 0.143865
polarizability: 1.60916824e+02 -9.60223510e+00 8.78578612e+01 4.85964703e-01 3.27624020e+00 6.43112302e+01
1716.lowfreq: -15.6625 -0.0029 -0.0018 -0.0018 2.3178 10.2981 17.1200 48.0147 99.1358
frequency: -0.7090 47.8111 99.1272 106.5807 143.3763 197.3721 213.0651 225.5283 264.8496 353.6187 358.0529 388.8250 419.6313 429.5584 562.1584 685.9038 810.9696 822.0491 860.0439 920.7639 949.4868 958.5814 995.1975 1061.9127 1109.2200 1120.7604 1176.8406 1185.3083 1212.7756 1247.3628 1317.5072 1341.0721 1371.9605 1379.3483 1396.2554 1431.1890 1449.6316 1458.8211 1465.7923 1470.2802 1481.8969 1485.1112 2972.7102 2972.8769 2976.5691 2984.2437 3008.6234 3052.6614 3066.4416 3072.4300 3077.5197 3083.6552 3090.7498 3117.3774
redmass: 2.9952 4.6621 3.8489 2.5094 1.1625 1.0754 3.3966 1.2123 3.3897 3.6403 3.1417 2.5294 2.1867 3.4663 7.1653 5.2761 2.6666 2.8885 1.3644 1.1949 1.8234 1.4612 1.4384 1.2535 2.0942 2.1889 2.1799 4.0054 1.5136 1.1928 1.4036 1.4051 1.1939 1.2027 1.2011 1.0887 1.0633 1.0484 1.0451 1.0525 1.0501 1.0513 1.0354 1.0376 1.0379 1.0819 1.0560 1.0966 1.0997 1.1000 1.0995 1.0996 1.1076 1.0982
irintensity: 0.5637 0.8806 0.9733 0.1668 1.0776 0.0632 0.4977 0.0586 0.1805 0.4646 0.8779 0.6258 0.4885 6.1238 20.7684 2.6095 7.3523 109.1258 4.6784 5.5198 11.8048 0.2021 0.1327 2.4854 108.3143 7.5090 5.5980 90.1591 8.6252 7.5826 1.3625 3.0674 21.8335 21.5448 20.0899 10.4700 5.0658 25.3766 0.4840 7.6166 11.1438 24.2893 26.0438 15.0373 22.7231 11.3805 21.3717 14.4769 11.7514 39.1076 39.3024 53.0207 37.3890 8.0864
temp: 298.150 k
press: 1.00000 atm
elementType: 16 16 6 6 6 6 6 6 1 1 1 1 1 1 1 1 1 1 1 1
symmnumber: 1
zpe: 433355.9 jmol-1
zpe.correction: 0.165057 hartree
zpe.thermalcorrener: 0.175450 hartree
zpe.thermalcorrenthalpy: 0.176394 hartree
zpe.thermalcorrgfe: 0.128574 hartree
zpe.sumelectzpe: -1031.292219 hartree
zpe.sumelectthermal: -1031.281826 hartree
zpe.sumelectthermalent: -1031.280882 hartree
zpe.sumelectthermalfe: -1031.328702 hartree
dipole: -4.0956 2.7944 0.5495
dipole: 4.9885
quadrupole: -71.6348 -64.2409 -65.3502
quadrupole: 4.0216 1.3670 0.2236
quadrupole: -4.5595 2.8344 1.7251 4.0216 1.3670 0.2236
hfenergy: -1031.4572761 hartree
pointgroup: C01 [X(C6H12S2)]
dipole: -1.4614091 1.0016612 0.844272 debye
dipolederiv: -0.767095 0.0786135 -0.1103941 -0.1006372 0.0078114 0.0269472 -0.3407952 0.0702462 -0.0297556 -0.93581 0.2120996 0.0715243 0.2840595 -0.2518748 -0.0939171 0.1488601 -0.1072249 -0.2201196 0.1430361 0.0023883 -0.0065662 0.158094 0.086906 -0.0212753 0.2071247 -0.0688272 0.1164182 0.2002116 -0.1160455 -0.1121129 -0.1821114 0.1114745 -0.0355856 -0.1708898 -0.0256898 0.0923617 -0.0263948 -0.0162877 0.0065567 -0.0366066 -0.098596 -0.0120355 -0.033991 -0.0098219 0.0852723 -0.1312179 0.0764436 0.0280972 -0.0264971 0.014493 -0.0395103 -0.0773778 -0.0053177 0.0957978 1.6405146 -0.2777623 0.0921222 -0.2024048 0.0639977 0.3225715 0.2249238 0.2935151 0.1825459 -0.1359315 0.0646089 0.0173443 0.0061231 -0.063817 -0.2480492 -0.0682985 -0.2292869 -0.1517272 0.059489 -0.0071347 0.0471169 -0.0262334 0.0236747 0.0302223 0.0104441 0.0495883 -0.147556 -0.0478492 -0.0350705 0.0243802 -0.0288975 -0.1332605 -0.0259859 0.0478431 -0.0315893 0.0576623 -0.016262 0.0417492 0.032025 0.076759 0.0402144 0.0309983 0.0237525 0.0133145 -0.1253859 0.0920441 -0.0192723 -0.0012575 -0.0065944 0.0589827 0.0032537 0.0493599 0.0727453 -0.1600736 -0.1775031 -0.0577168 -0.1013868 -0.0174322 0.082299 0.0122338 -0.1063248 -0.0067506 0.052482 0.0485801 0.1186544 0.0736547 0.1269618 -0.036736 -0.0387916 0.0746671 -0.0620115 0.0604003 0.0985229 0.0118755 -0.0116934 0.0040059 0.0686211 0.0674608 0.0526949 0.009963 -0.160432 -0.1990381 0.025181 -0.0706267 -0.001478 0.0844103 -0.0311321 -0.0898999 -0.0149606 0.0513679 0.0842005 -0.1040135 0.024943 -0.0482813 -0.1662316 0.0203518 0.0247423 0.0265502 0.0806678 -0.0615298 -0.0332255 -0.0893914 0.0024672 0.111374 -0.0210056 -0.0473961 -0.0311506 0.0792722 0.0328072 -0.0579644 0.1181658 -0.0529799 0.0565551 0.0395513 0.0906062 -0.0001404 -0.0069755 0.0992256 0.092879 -0.0325012 0.0716833 -0.0602979 0.0136974 -0.0200454 0.0568486 0.047777 unknown
polarizability: 156.3099559|-20.3776925|81.0597676|-4.5178574|13.1862685|75.7161924 unknown
InChI: InChI=1S/C6H12S2/c1-5(2)4-8-6(3)7/h5H,4H2,1-3H3
charge 0 multiplicity 1
20 atoms
S  0.605044 -0.739013 -0.639177
S  3.578431 -1.183709 -0.454336
C  -2.075095 0.125247 -0.332756
C  -0.679306 0.323483 0.299615
C  -2.602175 -1.31619 -0.139911
C  -3.05606 1.157707 0.278813
C  2.206857 -0.409642 0.1525
C  2.235143 0.546597 1.324903
H  -1.993328 0.331434 -1.419685
H  -0.359182 1.376714 0.223063
H  -0.679873 0.010712 1.358778
H  -2.712483 -1.548776 0.936785
H  -3.593073 -1.433519 -0.614641
H  -1.921292 -2.065394 -0.581463
H  -3.160361 1.004702 1.370094
H  -4.058882 1.049578 -0.17275
H  -2.71615 2.195908 0.107497
H  3.264765 0.633115 1.703358
H  1.580761 0.194616 2.146007
H  1.878956 1.552828 1.029707
