program: Gaussian 09
title: 000019344
version: EM64L-G09RevD.01
frameworkgroup: C1[X(C9H4F3N3)]
method: RPBEPBE
basis: SDD
operation: Freq
keyword: #pfreq=noraman
keyword: PBEPBE/SDD
title: #p freq=noraman PBEPBE/SDD
converged: NO YES NO YES
title: Mulliken charges:
elementType: F F F N N N C C C C C C C C C H H H H
charge: -0.112165 -0.156688 -0.156733 -0.433423 -0.008658 -0.009721 0.339386 0.021725 0.113618 -0.496184 -0.311278 0.259127 0.436569 -0.369713 -0.264528 0.344704 0.271958 0.267521 0.264484
chargesum: 0.00000
title: Mulliken charges with hydrogens summed into heavy atoms:
elementType: F F F N N N C C C C C C C C C
charge: -0.112165 -0.156688 -0.156733 -0.088719 -0.008658 -0.009721 0.339386 0.021725 0.113618 -0.224226 -0.043756 0.259127 0.436569 -0.105229 -0.264528
polarizability: 2.03344662e+02 6.37425569e+00 1.09498157e+02 -1.69092819e-03 8.91882275e-04 5.22438350e+01
1716.lowfreq: -30.2278 -13.2368 -4.0054 -1.7574 -0.0007 0.0004 0.0009 58.4830 100.9946
frequency: -30.2249 58.4716 100.9940 122.5201 159.4927 231.5570 259.0714 272.6171 310.9202 356.2031 424.6446 425.0702 443.5168 484.7072 503.4662 533.0492 551.5029 614.6357 621.4412 656.3789 661.0546 706.2832 732.1452 774.5647 809.5979 848.3991 890.3073 920.6595 940.7422 966.4581 979.6389 1039.7275 1102.6445 1131.9557 1141.5946 1223.0399 1252.9039 1271.4554 1304.7828 1372.5407 1379.3677 1441.9923 1490.7357 1521.8114 1580.1066 1640.5471 2180.4834 3164.9410 3169.7634 3186.4370 3587.3311
redmass: 9.0167 10.2555 13.2863 10.7411 9.4009 7.2823 5.7654 13.1973 10.6160 8.3753 3.9629 10.2535 10.0775 5.8149 10.0122 10.2615 7.5929 7.3149 1.2620 3.1435 11.7028 11.0926 7.5678 3.7227 5.7376 1.5154 1.5949 9.8180 3.6942 11.4925 1.3617 9.5350 5.5515 1.5789 2.3107 2.4093 2.2228 2.5006 2.2643 5.3606 4.5197 3.7106 4.1008 5.0022 8.1057 7.4408 12.6299 1.0893 1.0943 1.0981 1.0822
irintensity: 0.8013 4.3633 4.3412 3.1853 2.6528 8.1318 2.1492 5.4420 2.9414 0.0134 9.6144 4.9636 8.0972 4.9068 0.0474 0.8067 4.2650 2.8146 51.9193 35.1725 3.6576 1.0205 1.2540 0.0616 2.0742 41.3599 37.4793 61.7263 3.1279 280.9162 1.7557 215.0248 166.4408 6.9830 11.3635 8.9699 185.2947 15.5867 175.5770 33.2341 29.7563 10.2647 7.3758 49.3479 23.4859 1.7196 31.0580 0.5854 0.5072 1.9931 92.8272
temp: 298.150 k
press: 1.00000 atm
elementType: 9 9 9 7 7 7 6 6 6 6 6 6 6 6 6 1 1 1 1
symmnumber: 1
zpe: 308303.2 jmol-1
zpe.correction: 0.117426 hartree
zpe.thermalcorrener: 0.128444 hartree
zpe.thermalcorrenthalpy: 0.129388 hartree
zpe.thermalcorrgfe: 0.079898 hartree
zpe.sumelectzpe: -808.095533 hartree
zpe.sumelectthermal: -808.084516 hartree
zpe.sumelectthermalent: -808.083572 hartree
zpe.sumelectthermalfe: -808.133061 hartree
dipole: 0.5728 -1.2094 0.0003
dipole: 1.3382
quadrupole: -119.2153 -76.5646 -86.5971
quadrupole: -12.3468 0.0002 0.0007
quadrupole: -25.0896 17.5611 7.5286 -12.3468 0.0002 0.0007
hfenergy: -808.2129595 hartree
pointgroup: C01 [X(C9H4F3N3)]
dipole: 0.2177026 0.479385 -0.0000238 debye
dipolederiv: -0.659407 0.247232 -0.0001835 0.2460118 -0.5757348 0.0001296 -0.0001658 0.0001608 -0.2575598 -0.6960632 -0.1204375 0.1309051 -0.298882 -0.450172 0.2455054 0.2186917 0.2139372 -0.631711 -0.6958323 -0.120339 -0.1309669 -0.2987393 -0.450294 -0.2457176 -0.2186592 -0.2140461 -0.6318097 -0.3695546 0.0660751 -0.0000552 -0.2511025 -0.5502019 -0.0001063 -0.0000292 0.0000078 -0.2335635 -0.2477574 -0.1781885 -0.0000245 0.0589289 -0.3791333 0.0000016 -0.0000294 -0.0000699 -0.2191492 -0.4353166 0.0466369 -0.0001149 0.0820798 -0.2349115 0.0000467 -0.0000812 0.0000209 -0.2366124 0.1935517 0.2388364 0.0000727 0.3847514 -0.0407752 0.0001444 0.0000725 0.0000846 0.0908554 0.2059301 0.1180694 0.0001024 -0.0987185 -0.0068561 -0.0000389 0.0000781 0.0000402 0.0214027 -0.6088746 -0.2164675 -0.0002285 -0.1069207 0.6121967 -0.0000141 -0.000213 -0.0000597 -0.0564549 0.1309506 -0.1424232 0.0001053 0.023796 0.0008664 0.0000102 0.0001051 -0.0000509 -0.1643105 0.0656257 -0.0996446 0.0000554 0.0469371 0.146351 0.0000366 0.0000664 -0.000014 -0.1093058 2.5522031 0.0753647 0.0003962 0.3151854 1.4484123 0.0000738 0.0002788 -0.0000167 1.5727155 -0.1197437 0.0645819 -0.0000843 -0.0875518 0.2498265 -0.0000223 -0.0001225 0.0000357 0.1209363 -0.1076115 0.142124 0.0000388 0.1041923 -0.0351014 0.0000444 0.0000116 0.0000693 -0.1643512 0.4100094 -0.1291697 0.0001774 -0.160119 -0.0137428 -0.0000747 0.0001799 -0.0000618 0.0181838 0.215149 0.0372173 -0.0000493 0.0578903 0.2506604 0.0000167 -0.0000508 0.0000025 0.3550981 0.0782348 0.0103539 -0.0000457 0.0256408 -0.0147187 0.0000018 -0.0000386 0.0000002 0.1880662 0.0892274 0.0336585 -0.0000285 0.0100537 -0.0114207 -0.0000094 -0.0000261 0.0000011 0.167795 -0.000721 -0.0734802 -0.0000718 -0.0534338 0.0547489 -0.0000278 -0.0000683 -0.0000412 0.1697751 unknown
polarizability: 203.5248753|-4.8666505|109.3179223|0.05696|0.0011424|52.2438565 unknown
InChI: InChI=1S/C9H4F3N3/c10-9(11,12)8-14-6-2-1-5(4-13)3-7(6)15-8/h1-3,15H
charge 0 multiplicity 1
19 atoms
F  4.019376 -0.923475 0.001704
F  3.62714 1.011774 -1.130977
F  3.626529 1.01206 1.133469
N  0.86062 1.019992 0.000525
N  1.202239 -1.247046 0.000593
N  -5.260796 0.988798 -0.001777
C  -0.414863 0.445975 -0.000003
C  -0.1806 -0.975543 0.000008
C  1.776588 -0.037045 0.000763
C  -1.706205 1.000429 -0.000513
C  -1.271636 -1.875591 -0.000501
C  3.246918 0.231656 0.001198
C  -2.786041 0.081562 -0.000991
C  -2.567459 -1.338595 -0.000981
C  -4.13712 0.579115 -0.001491
H  1.089369 2.013809 0.000707
H  -1.893242 2.077631 -0.000553
H  -1.097981 -2.954716 -0.000513
H  -3.438434 -2.00009 -0.001367
