program: Gaussian 09
title: 000219223
version: EM64L-G09RevD.01
frameworkgroup: C1[X(C14H20)]
method: RPBEPBE
basis: SDD
operation: Freq
keyword: #p
keyword: freq=noraman
keyword: PBEPBE/SDD
title: #p freq=noraman PBEPBE/SDD
converged: YES YES NO NO
title: Mulliken charges:
elementType: C C C C C C C C C C C C C C H H H H H H H H H H H H H H H H H H H H
charge: -0.409418 -0.411136 -0.522155 -0.432894 0.351524 -0.374425 -0.135275 -0.432213 -0.348259 -0.287717 0.286916 -0.098852 -0.687376 -0.799622 0.206022 0.205782 0.206833 0.205158 0.220432 0.228307 0.213333 0.215646 0.227101 0.200055 0.198297 0.200550 0.212822 0.232425 0.219714 0.208846 0.210712 0.234863 0.235364 0.218641
chargesum: 0.00000
title: Mulliken charges with hydrogens summed into heavy atoms:
elementType: C C C C C C C C C C C C C C
charge: 0.002386 0.000855 -0.073416 -0.003915 0.351524 -0.147324 -0.135275 -0.033861 0.065113 -0.055292 0.286916 -0.098852 -0.048104 -0.110754
polarizability: 2.92802033e+02 -1.83138784e+01 1.38073170e+02 -1.15211402e+01 5.77605580e+00 1.01434785e+02
1716.lowfreq: -17.2827 -5.9585 -3.3984 -0.0007 -0.0005 -0.0002 5.3109 27.9996 35.5632
frequency: -2.0172 27.7398 34.9875 41.0700 68.4709 86.9011 118.7437 137.7560 156.5483 219.1720 221.3067 229.6333 271.7942 292.5952 336.0670 375.3916 411.8751 442.0216 473.1354 494.1642 515.4271 547.5645 556.7507 589.1058 714.8519 739.9842 788.0994 800.5238 842.5049 848.9377 867.6255 877.1301 899.1382 916.2221 923.4034 947.4302 982.2829 1036.5194 1042.7207 1054.1491 1065.4162 1076.6405 1088.7265 1096.7077 1105.2924 1130.8468 1156.6866 1169.1561 1222.1355 1236.8152 1255.9571 1264.2034 1282.0310 1301.3940 1306.8891 1331.1237 1334.3927 1340.1596 1345.8545 1348.8628 1361.7264 1385.8633 1391.7766 1451.7735 1458.7746 1459.7530 1464.8867 1468.7955 1471.8266 1473.6772 1475.0262 1477.2244 1485.5759 1621.7691 1648.3244 2210.7130 2942.1093 2952.7650 2968.7675 2971.7677 2978.9726 2979.0670 2979.5490 2982.9410 3001.4205 3021.1244 3027.3118 3039.9236 3043.2095 3049.3659 3060.7574 3070.5060 3072.9023 3092.3701 3102.6175 3114.2083
redmass: 2.4284 3.6324 2.1471 3.2960 2.6113 3.1753 1.0671 3.2303 2.8805 1.4893 1.7110 3.5646 2.3140 2.2856 2.4643 3.3236 3.6357 2.7434 3.4784 3.7003 3.0641 3.8521 5.1531 2.7963 2.0005 1.2620 2.6281 1.3674 1.9635 1.4731 2.0977 1.4386 1.5228 1.4493 2.2740 2.4477 2.0731 2.2777 1.4443 1.9474 1.8086 1.8207 2.0257 1.7632 1.7636 1.1611 2.5713 1.5502 1.3964 1.3067 1.3175 1.2617 1.1313 1.9159 1.2802 1.5160 1.4230 1.6795 1.5109 1.5313 2.2691 1.2128 1.2343 1.1008 1.0813 1.0828 1.0469 1.0846 1.0630 1.0940 1.0431 1.0711 1.0824 6.0976 6.6446 11.9800 1.0654 1.0654 1.0635 1.0355 1.0630 1.0615 1.0657 1.0371 1.0885 1.0949 1.0954 1.0993 1.0982 1.1041 1.0980 1.1011 1.0993 1.0897 1.0974 1.0909
irintensity: 0.0016 0.3033 0.2071 1.1953 0.5213 0.0927 0.0947 1.0879 1.6909 0.1029 0.0457 0.2857 0.1351 0.1966 1.0241 1.0471 3.5674 2.9088 4.0863 4.6319 5.2254 0.4407 0.2018 4.6914 9.6368 4.0100 4.2579 8.4811 1.0181 16.4104 1.5502 2.6017 31.2950 4.0623 9.5682 3.4757 4.9359 11.5475 1.7034 12.0108 0.4258 1.7456 10.0732 13.4924 0.0977 4.4410 3.5979 0.8252 0.2314 4.2791 4.8665 1.3607 0.5242 9.3452 0.5751 0.9207 6.2587 6.2960 7.4629 5.5814 20.2975 9.7821 19.3654 3.3115 17.7727 5.2272 12.2553 11.1884 0.4838 7.2956 12.8357 5.2047 18.0559 0.1032 3.2283 0.2079 48.6957 34.4014 20.4078 59.0642 10.9514 55.5080 24.4551 24.5219 60.9226 6.2745 20.6712 74.7293 13.2625 70.8329 17.6165 78.0251 50.6704 23.7595 40.7545 20.4533
temp: 298.150 k
press: 1.00000 atm
elementType: 6 6 6 6 6 6 6 6 6 6 6 6 6 6 1 1 1 1 1 1 1 1 1 1 1 1 1 1 1 1 1 1 1 1
symmnumber: 1
zpe: 778459.0 jmol-1
zpe.correction: 0.296499 hartree
zpe.thermalcorrener: 0.311823 hartree
zpe.thermalcorrenthalpy: 0.312767 hartree
zpe.thermalcorrgfe: 0.252114 hartree
zpe.sumelectzpe: -544.341816 hartree
zpe.sumelectthermal: -544.326492 hartree
zpe.sumelectthermalent: -544.325548 hartree
zpe.sumelectthermalfe: -544.386201 hartree
dipole: -0.1101 -0.1906 0.0761
dipole: 0.2329
quadrupole: -72.8558 -82.0659 -88.2044
quadrupole: 0.8042 -0.7213 1.3212
quadrupole: 8.1862 -1.0239 -7.1624 0.8042 -0.7213 1.3212
hfenergy: -544.6383151 hartree
pointgroup: C01 [X(C14H20)]
dipole: -0.0443064 0.0705103 -0.0381947 debye
polarizability: 292.4287506|21.2788888|139.3751165|8.3153457|1.3949776|100.5061205 unknown
InChI: InChI=1S/C14H20/c1-3-4-8-13(2)11-12-14-9-6-5-7-10-14/h8-9H,3-7,10H2,1-2H3
charge 0 multiplicity 1
34 atoms
C  -4.128654 1.526569 -0.413636
C  -5.068441 0.472323 0.213071
C  -2.67385 1.319449 0.063777
C  -4.651719 -0.951493 -0.225258
C  -2.239309 -0.149448 -0.01307
C  -3.153192 -1.164695 -0.157114
C  -0.834527 -0.410625 0.078243
C  4.19739 0.190218 0.501785
C  4.905518 0.93572 -0.666626
C  2.691748 0.249839 0.39841
C  1.810076 -0.797302 0.258283
C  0.39911 -0.543326 0.164403
C  6.440901 0.953022 -0.50772
C  2.209995 -2.26832 0.195575
H  -4.465031 2.549276 -0.157473
H  -4.170968 1.437214 -1.517788
H  -6.118997 0.664832 -0.075715
H  -5.014743 0.548673 1.317346
H  -2.56149 1.669829 1.110524
H  -1.977876 1.932846 -0.539601
H  -4.999968 -1.141809 -1.264371
H  -5.161123 -1.711998 0.400803
H  -2.785084 -2.197188 -0.229491
H  4.563781 -0.852182 0.539751
H  4.515999 0.668964 1.452924
H  4.52291 1.974682 -0.718707
H  4.627901 0.452037 -1.623271
H  2.26067 1.262223 0.425035
H  6.926541 1.482065 -1.348036
H  6.737127 1.461695 0.429289
H  6.849094 -0.074813 -0.474446
H  1.828094 -2.731572 -0.732853
H  1.765852 -2.825513 1.041451
H  3.302467 -2.406795 0.227208
