program: Gaussian 09
title: 000219222
version: EM64L-G09RevD.01
frameworkgroup: C1[X(C16H18O)]
method: RPBEPBE
basis: SDD
operation: Freq
keyword: #pfreq=noraman
keyword: PBEPBE/SDD
title: #p freq=noraman PBEPBE/SDD
converged: YES YES NO NO
title: Mulliken charges:
elementType: O C C C C C C C C C C C C C C C C H H H H H H H H H H H H H H H H H H
charge: -0.477368 0.136390 0.313463 -0.624807 0.190398 -0.735859 0.399846 -0.399028 0.601275 -0.369910 -0.466873 -0.245424 -0.439687 -0.837248 -0.298721 -0.249692 -0.728686 0.213497 0.196584 0.252143 0.200494 0.232350 0.298423 0.340144 0.212193 0.237194 0.225839 0.236947 0.218975 0.267805 0.205363 0.225683 0.228371 0.219663 0.220264
chargesum: 0.00000
title: Mulliken charges with hydrogens summed into heavy atoms:
elementType: O C C C C C C C C C C C C C C C C
charge: -0.137224 0.136390 0.313463 -0.214725 0.190398 -0.050871 0.399846 -0.100605 0.601275 -0.157717 -0.229679 -0.019584 -0.202740 -0.145106 -0.073038 -0.021321 -0.288759
polarizability: 2.03846207e+02 2.32666820e+01 1.85104392e+02 2.07831685e+01 -1.40373655e+01 1.28572214e+02
1716.lowfreq: -12.2799 -9.3517 -7.3732 -0.0008 -0.0008 0.0004 26.3631 50.5542 59.0166
frequency: 25.7936 50.4587 58.9888 96.4019 161.6172 176.6440 184.1989 203.0562 217.4805 223.0447 259.1111 262.7251 300.3431 332.3055 347.5169 364.0442 414.9341 420.2450 455.8634 459.5126 475.3627 507.1365 535.2341 537.3063 569.6644 599.2460 658.9232 661.5853 708.1186 745.7758 787.5923 788.5640 792.0770 816.8297 818.0559 854.0859 874.3916 908.8070 925.1754 937.9571 940.1647 960.2147 982.4103 987.3048 988.8746 995.7007 1010.5372 1033.8987 1043.8477 1065.6543 1077.5046 1095.3232 1143.5975 1149.4423 1165.8627 1177.0014 1181.4227 1211.5058 1236.7781 1266.9202 1295.2883 1303.7497 1351.7411 1368.6248 1389.8583 1393.7532 1400.8956 1409.0837 1428.4794 1439.1039 1449.4393 1454.4120 1457.3709 1467.8609 1476.8441 1479.9277 1518.9346 1588.1031 1599.7171 1630.9932 1665.8050 2939.5395 2966.5453 2977.3379 3050.7430 3057.0618 3076.0160 3088.4840 3089.6985 3107.4565 3119.1359 3121.5785 3131.4458 3147.3383 3155.9876 3181.5165 3186.4858 3191.3392 3565.1954
redmass: 3.2343 3.7402 4.2007 3.2134 2.7944 3.6816 3.6074 1.2498 2.3225 1.1940 2.8420 1.0935 4.3197 4.6655 3.6952 3.1074 2.6132 2.5468 3.2654 2.7355 3.2467 4.1065 3.8202 4.3398 3.6075 2.7117 2.4103 4.0356 1.5440 1.2985 5.1322 2.5478 2.8285 1.6571 2.7084 3.4776 1.7925 2.0459 1.6797 1.3368 1.3873 1.4165 1.8977 1.3809 2.4916 1.3928 1.5684 2.2041 1.7082 2.0684 1.6010 2.3383 2.5091 1.4675 1.2349 1.1774 1.2160 1.6253 1.8955 1.6190 3.2698 1.3315 1.7852 2.5093 1.2107 1.2262 3.0345 4.3305 1.1955 2.3273 1.2915 1.5167 1.1615 1.0707 1.0775 1.0703 3.8404 7.2669 5.5327 6.5854 4.8838 1.0692 1.0399 1.0403 1.0918 1.0897 1.0942 1.0768 1.0855 1.0994 1.0866 1.0864 1.0900 1.0964 1.0974 1.0932 1.0929 1.1140 1.0657
irintensity: 0.0158 0.0270 0.3863 0.2133 0.6549 4.0237 2.6039 5.6479 0.2047 3.8740 11.2365 145.6524 5.2232 6.5159 5.1084 1.0675 1.6939 3.5190 0.3840 6.0632 0.8706 5.9884 15.9663 5.4903 16.5541 3.2110 1.1985 2.4297 1.9596 10.8984 3.2923 41.6970 44.9247 48.7520 9.4021 7.3837 9.0596 1.6635 8.1751 49.5032 30.7610 1.4240 1.6674 0.3599 3.7423 6.4660 2.7194 6.0373 3.6365 15.8378 94.2922 5.3833 25.4545 5.5399 24.0012 0.8360 11.3456 0.8928 1.3008 2.0198 11.2751 6.8983 25.3984 9.0653 18.0487 33.8995 3.5572 8.0266 1.2859 2.4558 1.2671 1.4913 15.7077 10.3425 13.0757 16.2783 13.4266 3.5304 4.6678 0.4843 18.2131 46.5132 40.2694 45.9507 22.1401 18.2329 33.8817 19.4908 6.9835 14.6610 0.8573 5.0024 13.4288 34.7304 39.9985 21.2780 2.4273 25.4663 2.9592
temp: 298.150 k
press: 1.00000 atm
elementType: 8 6 6 6 6 6 6 6 6 6 6 6 6 6 6 6 6 1 1 1 1 1 1 1 1 1 1 1 1 1 1 1 1 1 1
symmnumber: 1
zpe: 765329.1 jmol-1
zpe.correction: 0.291498 hartree
zpe.thermalcorrener: 0.307608 hartree
zpe.thermalcorrenthalpy: 0.308552 hartree
zpe.thermalcorrgfe: 0.248356 hartree
zpe.sumelectzpe: -694.473221 hartree
zpe.sumelectthermal: -694.457112 hartree
zpe.sumelectthermalent: -694.456168 hartree
zpe.sumelectthermalfe: -694.516364 hartree
dipole: 0.6989 -1.0855 0.9440
dipole: 1.5994
quadrupole: -90.3203 -97.9851 -102.1876
quadrupole: -0.5471 6.6264 -5.8569
quadrupole: 6.5107 -1.1540 -5.3566 -0.5471 6.6264 -5.8569
hfenergy: -694.7647197 hartree
pointgroup: C01 [X(C16H18O1)]
dipole: -0.2461665 0.4672305 0.3421172 debye
polarizability: 198.9012749|21.238446|187.7047565|-30.0061836|5.0742933|130.9167814 unknown
InChI: InChI=1S/C16H18O/c1-12(2)11-16(3,17)15-10-6-8-13-7-4-5-9-14(13)15/h4-10,17H,1,11H2,2-3H3
charge 0 multiplicity 1
35 atoms
O  -2.575836 -0.886206 1.449027
C  -1.530244 0.15572 1.221541
C  -0.333361 -0.582935 0.585032
C  -2.155567 1.265609 0.298785
C  0.901869 0.086198 0.214497
C  -1.179622 0.731395 2.620249
C  1.973931 -0.706366 -0.372011
C  -0.446078 -1.96391 0.370988
C  -2.424383 0.876097 -1.151117
C  1.154736 1.493936 0.380465
C  1.802385 -2.114483 -0.571743
C  0.610506 -2.731595 -0.203786
C  3.206511 -0.07729 -0.751338
C  -3.50067 -0.160191 -1.417609
C  2.365668 2.079091 0.003063
C  3.408646 1.290133 -0.570716
C  -1.735725 1.468174 -2.163808
H  -1.506433 2.157375 0.313345
H  -3.108979 1.569189 0.786566
H  -0.933274 -0.103695 3.297763
H  -2.047035 1.280746 3.037048
H  -0.319253 1.419278 2.600501
H  -1.375066 -2.456967 0.662828
H  -3.357682 -0.435601 1.857392
H  0.388965 2.141883 0.810974
H  2.622736 -2.690917 -1.015925
H  0.471917 -3.808211 -0.351638
H  3.994191 -0.701068 -1.191256
H  -3.655151 -0.306994 -2.500568
H  -3.233154 -1.128244 -0.957992
H  -4.466645 0.145994 -0.967698
H  2.516249 3.154797 0.148103
H  4.354291 1.758483 -0.864236
H  -0.95259 2.211541 -1.973881
H  -1.924552 1.209936 -3.21234
